program: Gaussian 09
title: 000070643
version: EM64L-G09RevD.01
frameworkgroup: C1[X(C9H8O3)]
method: RPBEPBE
basis: SDD
operation: Freq
keyword: #p
keyword: freq=noraman
keyword: PBEPBE/SDD
title: #p freq=noraman PBEPBE/SDD
converged: YES YES NO NO
title: Mulliken charges:
elementType: O O O C C C C C C C C C H H H H H H H H
charge: -0.248401 -0.186084 -0.142279 0.322996 0.332595 -0.341389 -0.325009 -0.350399 -0.342845 0.044913 -0.537020 -0.132768 0.227012 0.281912 0.248179 0.261827 0.228586 0.229203 0.254422 0.174549
chargesum: 0.00000
title: Mulliken charges with hydrogens summed into heavy atoms:
elementType: O O O C C C C C C C C C
charge: -0.248401 -0.186084 -0.142279 0.322996 0.332595 -0.114376 -0.043097 -0.102220 -0.081019 0.044913 0.175192 0.041780
polarizability: 1.96906755e+02 6.11441996e+00 1.02911949e+02 -1.99099416e+00 -8.10427952e-01 4.85183173e+01
1716.lowfreq: -7.4868 -4.9134 -0.0009 -0.0002 0.0005 7.0318 36.9577 55.4910 74.3069
frequency: 36.9393 55.4839 74.2883 138.0609 161.6019 218.4039 248.0912 276.6362 293.2982 329.8137 410.7146 444.1031 467.6736 485.8706 564.2612 605.1051 627.8444 736.7869 769.3857 805.0952 822.1744 857.3730 927.0460 944.3987 968.8364 981.9011 996.8719 1003.2076 1112.6756 1118.2395 1156.9909 1183.3580 1243.9428 1251.8328 1302.6826 1367.2810 1386.9348 1436.4263 1439.4396 1470.8450 1471.2040 1498.1791 1542.1575 1574.1837 1618.7326 1633.8263 2884.5295 2972.2344 3065.4714 3137.5279 3145.3210 3153.7923 3170.6282 3176.3137
redmass: 5.6792 4.2044 4.3424 4.3999 3.5227 1.2525 3.2163 6.0876 4.1115 10.0111 2.9200 6.5786 4.1470 3.4024 2.8929 5.5369 6.8594 3.7056 6.0123 1.6215 3.0487 1.6284 2.7568 1.5869 3.0483 7.1593 1.6008 1.9466 1.2589 1.3270 1.3159 1.2666 2.6300 4.6158 1.2901 2.2722 1.8499 2.1739 1.5813 1.0506 1.0837 2.4625 9.1567 8.0333 6.2743 9.4940 1.0851 1.0326 1.1045 1.1001 1.0882 1.0887 1.0952 1.0973
irintensity: 7.0908 4.5933 0.6159 10.8045 2.7114 0.2992 11.7419 0.4545 4.0537 5.8728 0.4645 1.1708 2.3852 7.3551 34.2450 21.8010 5.0639 2.7914 1.3857 31.8235 21.0412 61.2814 6.9335 2.6127 19.9160 33.4376 1.6395 2.0165 0.1648 15.6364 10.1780 166.4990 16.2989 326.7069 3.6787 0.2750 3.7859 63.2304 4.4801 17.2539 39.3623 57.6548 330.1391 86.5463 186.2298 63.2868 85.5989 61.4167 39.3210 21.0281 6.4381 0.0709 10.8280 4.6920
temp: 298.150 k
press: 1.00000 atm
elementType: 8 8 8 6 6 6 6 6 6 6 6 6 1 1 1 1 1 1 1 1
symmnumber: 1
zpe: 387386.8 jmol-1
zpe.correction: 0.147548 hartree
zpe.thermalcorrener: 0.158789 hartree
zpe.thermalcorrenthalpy: 0.159733 hartree
zpe.thermalcorrgfe: 0.109246 hartree
zpe.sumelectzpe: -572.519274 hartree
zpe.sumelectthermal: -572.508033 hartree
zpe.sumelectthermalent: -572.507089 hartree
zpe.sumelectthermalfe: -572.557576 hartree
dipole: -7.3533 -3.2652 0.8092
dipole: 8.0863
quadrupole: -82.9275 -64.5593 -70.5845
quadrupole: 3.5452 3.7328 -0.1708
quadrupole: -10.2371 8.1311 2.1059 3.5452 3.7328 -0.1708
hfenergy: -572.6668222 hartree
pointgroup: C01 [X(C9H8O3)]
dipole: 2.8566126 1.3375187 0.4147571 debye
dipolederiv: -1.9932411 -0.3967155 0.0028205 -0.2405839 -0.374722 -0.0000788 0.0282461 0.001017 -0.291335 -0.9787672 -0.0998411 0.0058873 -0.6569475 -0.6376773 -0.0619406 -0.1012546 -0.0606676 -0.3163672 -0.9417912 0.1679918 -0.0632194 0.1974813 -0.3769162 -0.0291366 -0.0725221 -0.0144217 -0.3303438 -1.1950644 -0.1326102 0.0016721 0.0405042 -0.2013138 -0.0254611 0.0996292 -0.0231253 -0.0409298 1.8381372 0.2411185 -0.012264 -0.0923929 0.1500791 0.0053974 -0.0567777 -0.0007584 0.1327349 0.5479787 0.0687184 -0.0053741 0.2667832 0.1221544 0.0021505 0.0496129 0.0066748 -0.1109188 0.4112369 0.0736556 0.0002976 -0.2400425 0.0697268 0.009673 -0.082495 0.0147284 -0.0918579 -0.6674372 -0.0093699 0.0052991 0.5027927 -0.0231895 0.0047398 0.0360684 0.0139534 -0.2022685 -0.5356777 -0.1697261 -0.0079094 -0.4860561 -0.0360243 0.0173373 -0.0270346 0.0146705 -0.1700229 1.696169 0.1658985 -0.0351167 0.6191958 0.4893507 0.0297439 0.1126343 0.0248097 0.167206 0.6716771 0.1874524 0.0056838 0.5964711 0.4544353 -0.0015502 0.0278723 0.0059595 0.3148511 1.004459 -0.0823743 0.2048804 -0.3108717 0.4918995 0.2212102 0.0332512 0.2187083 0.3314509 0.0403033 0.0891096 0.0069771 0.0879131 -0.0272198 -0.007793 0.0140437 -0.0157867 0.1442087 0.0935202 -0.0770505 -0.0033216 -0.009574 0.023934 -0.0062527 0.0038217 -0.0113844 0.1519183 0.0301663 -0.0790128 -0.0025636 -0.0916947 -0.030623 -0.0114204 -0.0037702 -0.0126805 0.1680742 0.0357511 0.074237 0.0076888 0.06584 0.0104703 -0.0128815 0.0149701 -0.0118341 0.1701338 0.0603084 0.0269467 0.0770087 -0.1487323 -0.029531 -0.0830442 -0.0076309 -0.1012454 -0.0894938 0.0552534 0.0415823 -0.0783382 -0.1424427 -0.0541492 0.0922379 -0.0174906 0.1036873 -0.0601393 -0.1412568 0.007476 0.0062366 0.0527178 0.0821079 -0.004269 0.0101734 -0.0034123 0.1282023 -0.031725 -0.0974865 -0.116345 -0.010361 -0.102792 -0.138662 -0.0613478 -0.1488923 -0.0051032 unknown
polarizability: 196.4752572|8.9182155|102.6908227|0.9192634|6.1117929|49.1709412 unknown
InChI: InChI=1S/C9H8O3/c1-12-8-4-2-7(3-5-8)9(11)6-10/h2-6H,1H3
charge 0 multiplicity 1
20 atoms
O  3.476783 -0.193715 -0.042928
O  -2.827187 -1.463368 -0.180783
O  -4.276574 0.996823 0.009394
C  -0.751093 -0.242524 0.045111
C  2.087375 -0.131049 -0.011537
C  -0.069882 1.005054 0.120523
C  0.027169 -1.436021 -0.064975
C  1.336551 1.069879 0.087834
C  1.423141 -1.387804 -0.089063
C  -2.231191 -0.366664 0.037716
C  4.232121 1.064869 0.020522
C  -3.078875 0.888141 0.349039
H  -0.627596 1.945074 0.18273
H  -0.504045 -2.39101 -0.133376
H  1.833645 2.042471 0.140076
H  2.029613 -2.294526 -0.16912
H  4.03396 1.600697 0.967995
H  3.991007 1.717225 -0.839875
H  5.288269 0.764369 -0.023766
H  -2.579991 1.68778 0.950684
