program: Gaussian 09
title: 000070657
version: EM64L-G09RevD.01
frameworkgroup: C1[X(C12H16BrNO)]
method: RPBEPBE
basis: SDD
operation: Freq
keyword: #p
keyword: freq=noraman
keyword: PBEPBE/SDD
title: #p freq=noraman PBEPBE/SDD
converged: YES YES NO NO
title: Mulliken charges:
elementType: Br O N C C C C C C C C C C C C H H H H H H H H H H H H H H H H
charge: -0.005164 -0.268558 -0.091414 -0.356691 -0.370813 -0.442898 -0.448898 -0.387462 -0.315505 0.365589 -0.333804 -0.365982 -0.174192 -0.154798 -0.230696 0.231416 0.178635 0.187534 0.217038 0.230392 0.207864 0.218170 0.226253 0.195312 0.232986 0.224645 0.220666 0.256273 0.257021 0.246575 0.250504
chargesum: 0.00000
title: Mulliken charges with hydrogens summed into heavy atoms:
elementType: Br O N C C C C C C C C C C C C
charge: -0.005164 -0.268558 -0.091414 0.053360 0.033759 -0.004642 -0.004474 0.040836 0.129807 0.365589 -0.077531 -0.108962 0.072383 0.095706 -0.230696
polarizability: 2.41865681e+02 -6.19562587e+00 1.35795840e+02 2.56333144e+00 5.96136766e+00 9.02201969e+01
1716.lowfreq: -21.0245 -6.9421 -1.0333 -0.0006 -0.0004 0.0006 7.4087 26.4950 39.0468
frequency: -14.5955 26.2638 38.9364 44.9586 70.3238 118.2936 137.3983 143.2249 172.8836 204.9435 252.4129 305.9724 318.1865 332.2258 369.3941 414.1204 492.1333 501.7973 571.2629 616.6151 622.1787 649.1893 697.7579 766.2474 796.3035 801.1309 823.0445 829.2304 841.7133 866.5574 902.3242 933.7274 956.4587 957.7906 966.2011 981.1419 986.2844 1057.4888 1060.1694 1070.4378 1092.9707 1099.0811 1109.8775 1140.7233 1149.3542 1176.4510 1186.4359 1197.6176 1208.7453 1223.2987 1226.6370 1242.9079 1276.1600 1289.6334 1290.2049 1299.9464 1312.0194 1339.5099 1350.9974 1366.7080 1397.7864 1402.8124 1462.5009 1463.6716 1467.6634 1478.1948 1479.6772 1486.6645 1497.5511 1578.6753 1600.8550 2842.5912 2854.1750 2867.8409 2965.6147 3012.6428 3020.8702 3025.6762 3028.4812 3042.9731 3050.7957 3069.6743 3093.3244 3156.2106 3157.4325 3174.7454 3178.5221
redmass: 1.9937 4.5282 4.2781 2.5600 4.0225 4.1122 5.0626 2.5762 7.0129 2.8046 3.4590 6.8249 7.5587 2.2861 3.7232 2.9956 4.2210 2.7266 4.1924 2.7678 6.7253 5.2413 3.4256 1.7004 2.9462 1.2769 1.3437 1.3159 2.2112 2.1835 2.5670 1.3380 1.3834 1.9487 1.5953 5.5474 4.6551 2.4388 2.9233 2.0111 2.0176 1.7676 1.3153 2.2174 1.9018 1.1821 1.2755 1.3298 1.5082 1.5986 3.6450 1.2336 1.1623 1.2609 1.2874 1.2643 1.3115 1.4421 1.4780 4.3597 1.6085 3.3707 1.1563 1.1757 1.6134 1.1040 1.0805 1.1576 1.0993 7.4114 6.4941 1.0710 1.0725 1.0694 1.0558 1.0604 1.0772 1.0809 1.0920 1.0872 1.0983 1.1042 1.1056 1.0878 1.0884 1.0964 1.0976
irintensity: 0.1905 0.0274 0.1185 0.4052 0.1335 0.2072 0.5469 4.4839 0.8729 3.1514 1.6977 2.6264 2.7563 7.4430 3.8755 0.0256 0.8823 24.9665 24.6297 5.9823 4.3183 19.5028 0.2637 0.2321 2.8393 16.2781 42.6739 28.6235 7.2694 11.5595 7.4205 0.0811 0.4148 7.3182 0.4471 81.6329 39.0983 14.1253 20.8336 28.3241 1.1421 0.5719 11.7975 6.6544 49.2577 59.4883 1.3529 5.8564 3.4041 29.5101 288.0379 11.0940 4.3944 0.6795 8.8943 2.6648 5.0940 3.0715 3.2582 11.0187 0.7666 1.1806 25.3532 53.9288 188.0240 8.4278 1.8101 2.3850 3.5215 15.5139 34.7081 76.5794 51.6999 163.3553 30.8302 18.8882 56.5201 43.5571 26.3654 24.4966 62.5895 7.5257 72.0079 9.3918 1.2708 11.3325 1.1679
temp: 298.150 k
press: 1.00000 atm
elementType: 35 8 7 6 6 6 6 6 6 6 6 6 6 6 6 1 1 1 1 1 1 1 1 1 1 1 1 1 1 1 1
symmnumber: 1
zpe: 670708.0 jmol-1
zpe.correction: 0.255459 hartree
zpe.thermalcorrener: 0.269627 hartree
zpe.thermalcorrenthalpy: 0.270571 hartree
zpe.thermalcorrgfe: 0.211309 hartree
zpe.sumelectzpe: -609.141144 hartree
zpe.sumelectthermal: -609.126976 hartree
zpe.sumelectthermalent: -609.126032 hartree
zpe.sumelectthermalfe: -609.185294 hartree
dipole: -4.0432 -0.4055 0.4516
dipole: 4.0885
quadrupole: -97.4658 -94.2315 -102.5726
quadrupole: 2.4019 -1.9026 0.7876
quadrupole: 0.6241 3.8585 -4.4826 2.4019 -1.9026 0.7876
hfenergy: -609.396603 hartree
pointgroup: C01 [X(C12H16Br1N1O1)]
dipole: -1.5991001 -0.0575539 0.1640254 debye
polarizability: 240.7728129|-11.5859759|137.4311719|5.7599779|1.4825195|89.6777327 unknown
InChI: InChI=1S/C12H16BrNO/c13-11-3-5-12(6-4-11)15-10-9-14-7-1-2-8-14/h3-6H,1-2,7-10H2
charge 0 multiplicity 1
31 atoms
Br 6.268435 -0.925046 0.099742
O  0.399432 0.99575 0.044832
N  -3.191485 0.069765 -0.323796
C  -4.422204 0.840671 -0.642485
C  -3.566948 -0.834097 0.801543
C  -5.521488 -0.240016 -0.602604
C  -5.057801 -1.206793 0.536199
C  -1.997335 0.901279 -0.09149
C  -0.72047 0.053533 -0.132643
C  1.699777 0.477194 0.043904
C  2.01946 -0.893452 -0.126547
C  2.734181 1.429401 0.228939
C  3.372821 -1.305327 -0.109584
C  4.081043 1.019848 0.245695
C  4.387896 -0.348869 0.076215
H  -4.32741 1.331621 -1.627383
H  -4.627996 1.634424 0.121475
H  -3.468075 -0.30928 1.786086
H  -2.909939 -1.721794 0.829478
H  -5.550766 -0.774082 -1.56782
H  -6.521125 0.188919 -0.415695
H  -5.658085 -1.068676 1.452397
H  -5.164875 -2.260027 0.226687
H  -2.038905 1.448337 0.884572
H  -1.930858 1.660239 -0.892237
H  -0.640406 -0.464897 -1.108344
H  -0.703504 -0.698558 0.68202
H  1.239388 -1.645189 -0.274787
H  2.465754 2.482007 0.357971
H  3.622574 -2.362067 -0.241765
H  4.877514 1.755581 0.388725
