program: Orca
programVersion: 6.0.0
elementType: C H H H
charge: 0
multiplicity: 2
keywords: SP revDSD-PBEP86-D4/2021 def2-TZVP def2-TZVP/C def2/J TightSCF
keywords: NoFrozenCore
formula: CH3
InChI: InChI=1/CH3/h1H3
4 atoms
C  -0.00007 0.00003 0.000061
H  1.015318 0.346497 0.091756
H  -0.507304 -0.413447 0.855107
H  -0.507183 0.066596 -0.947591
totalener: -39.68141780543902 hartree
nucrepener: 9.69708078990815 hartree
electener: -49.37849299048803 hartree
oneelecener: -71.65166615042898 hartree
twoeener: 22.27317315994095 hartree
kineticenergy: 39.57307135996888 hartree
exchangeener: -1.913287089894 hartree
correlationener: -0.120525979292 hartree
xcener: -2.033813069187 hartree
s2: 0.758133
energy: -294.4786 -23.1602 -14.2216 -14.2160 -8.9868 3.4760 5.2343 5.2344 7.4294 7.4320 8.0963 8.1312 14.9846 16.3654 16.3720 19.5518 electronvolt
energy: -293.9402 -21.2194 -13.8734 -13.8676 1.1278 3.7837 5.3358 5.3360 7.5292 7.5315 8.8383 10.5326 15.8282 16.5994 16.6059 electronvolt
chargesum: 0.0000000
charge: -0.400399 0.133403 0.133454 0.133541
charge: -0.257943 0.085962 0.085968 0.086014
qa: -0.4004 0.1334 0.1335 0.1335
va: 3.8895 0.9711 0.9711 0.9711
total: -39.773414030 hartree
dispersion: -0.000480370 hartree
energy: -39.773894400321 hartree
dipole: 0.000779609 -0.000609922 0.000169687 -0.000331772 0.000099659 -0.000232113 -0.000682971 0.000591346 -0.000091625
dipolemethod: SCF
magnitude: 0.000301771 au
magnitude: 0.000767040 debye
