program: Gaussian 09
title: 000070659
version: EM64L-G09RevD.01
frameworkgroup: C1[X(C11H12N2O2S)]
method: RPBEPBE
basis: SDD
operation: Freq
keyword: #p
keyword: freq=noraman
keyword: PBEPBE/SDD
title: #p freq=noraman PBEPBE/SDD
converged: YES YES NO NO
title: Mulliken charges:
elementType: S O O N N C C C C C C C C C C C H H H H H H H H H H H H
charge: 0.970820 -0.538054 -0.533294 -0.472240 -0.698537 0.393469 -0.259785 0.471219 -0.288100 -0.396449 -0.453773 -0.648538 -0.241426 0.544254 -0.455507 -0.606996 0.300794 0.287980 0.242757 0.233848 0.239641 0.226953 0.309096 0.277227 0.221161 0.247633 0.314171 0.311676
chargesum: 0.00000
title: Mulliken charges with hydrogens summed into heavy atoms:
elementType: S O O N N C C C C C C C C C C C
charge: 0.970820 -0.538054 -0.533294 -0.163144 -0.072690 0.393469 -0.259785 0.471219 0.012694 -0.108469 -0.211016 -0.414690 -0.001785 0.544254 -0.228554 0.139025
polarizability: 2.36177956e+02 -2.31303736e+01 1.87619331e+02 4.56572683e+00 9.16200454e-01 1.00162483e+02
1716.lowfreq: -9.0442 -4.2631 0.0013 0.0020 0.0022 7.0714 33.7359 48.4862 78.0583
frequency: 33.6432 48.4320 78.0408 108.2847 134.6590 140.5806 164.4427 194.1758 230.4891 235.2801 257.5933 284.2289 295.7361 313.6072 356.8979 378.7559 402.6155 416.1041 430.6357 445.8774 456.0612 464.2841 516.0779 527.0874 563.2643 640.8030 647.2754 707.6155 716.1712 763.5338 780.5124 798.7030 813.8626 836.0774 874.5729 897.0730 926.3643 938.8252 949.7347 974.3623 986.7455 1024.7884 1045.6911 1062.7392 1092.9592 1102.0155 1131.5679 1168.3656 1195.5759 1210.9094 1271.6054 1329.1040 1335.3650 1360.4173 1398.6282 1412.5636 1417.8885 1440.7804 1460.2134 1470.3622 1483.9407 1514.0974 1566.1203 1608.4996 1641.7604 1650.7581 2942.3829 3052.6501 3099.4199 3121.2557 3123.2807 3129.5973 3144.7181 3149.9196 3166.2244 3418.7743 3564.0382 3703.4223
redmass: 4.3735 3.6734 3.4522 2.5219 5.1543 3.3636 1.5323 4.3909 6.3292 10.5301 4.6438 5.0802 4.4344 3.8082 3.6027 1.1105 2.8193 1.3836 5.0251 3.7088 6.3474 6.9665 3.0912 6.5434 5.2510 6.0530 2.6540 1.6358 5.6331 2.0049 5.4699 1.4747 6.8483 1.7580 1.7739 5.0186 1.4823 4.4700 5.1185 1.3667 1.3636 2.9990 1.5129 2.0574 1.5275 1.4246 2.0640 1.1884 1.5294 1.4240 1.6777 2.3512 1.2802 1.6691 3.2002 1.1248 6.3046 4.1575 1.0478 3.2465 1.0535 3.6341 7.7281 5.7013 1.6185 2.6256 1.0432 1.0906 1.0994 1.0898 1.0895 1.0877 1.0975 1.0910 1.0985 1.0758 1.0451 1.1040
irintensity: 2.0701 1.3444 1.5651 7.3888 5.1359 3.8302 0.7258 1.7277 1.4239 4.0353 3.2496 9.3642 1.0583 18.2096 35.6528 85.5351 5.9776 229.4046 40.0374 19.4834 133.0344 21.0018 0.8996 7.2817 11.4276 6.0382 0.7059 34.2489 5.0130 26.3740 5.1110 16.1814 87.5148 77.8136 52.9450 4.5730 6.8039 57.0696 21.5412 1.2218 2.4317 4.5968 3.4436 0.9767 31.5895 14.5153 16.3094 12.0178 5.4104 14.0489 27.0492 48.5844 9.7659 11.7425 15.0434 13.5418 1.7564 21.2270 14.6098 38.2786 15.3330 103.8459 4.9399 6.2885 5.2220 421.3037 51.1268 21.4660 2.4155 14.1468 10.0058 10.8115 15.0420 12.4566 20.3078 9.9163 111.0885 23.6564
temp: 298.150 k
press: 1.00000 atm
elementType: 16 8 8 7 7 6 6 6 6 6 6 6 6 6 6 6 1 1 1 1 1 1 1 1 1 1 1 1
symmnumber: 1
zpe: 554717.3 jmol-1
zpe.correction: 0.211281 hartree
zpe.thermalcorrener: 0.227085 hartree
zpe.thermalcorrenthalpy: 0.228030 hartree
zpe.thermalcorrgfe: 0.168233 hartree
zpe.sumelectzpe: -1083.053247 hartree
zpe.sumelectthermal: -1083.037442 hartree
zpe.sumelectthermalent: -1083.036498 hartree
zpe.sumelectthermalfe: -1083.096295 hartree
dipole: 8.0551 1.3183 4.7185
dipole: 9.4280
quadrupole: -90.9059 -92.6092 -106.5456
quadrupole: -10.3612 -8.7107 -4.2771
quadrupole: 5.7810 4.0777 -9.8587 -10.3612 -8.7107 -4.2771
hfenergy: -1083.2645276 hartree
pointgroup: C01 [X(C11H12N2O2S1)]
dipole: -3.1980212 -0.5477386 1.7975781 debye
polarizability: 238.1326922|-21.0239678|185.3486063|0.6775393|-6.5123519|100.478471 unknown
InChI: InChI=1S/C11H12N2O2S/c1-13-16(14,15)11-4-2-3-8-7-9(12)5-6-10(8)11/h2-7,13H,12H2,1H3
charge 0 multiplicity 1
28 atoms
S  2.386191 0.745242 -0.469283
O  3.728684 -0.150856 -0.650713
O  1.996235 1.941975 -1.497491
N  2.592342 1.583901 1.166837
N  -4.530648 1.092234 0.119431
C  -0.42272 -0.024463 -0.204693
C  0.929031 -0.485567 -0.273653
C  -1.440684 -1.036692 0.044442
C  1.312989 -1.817089 -0.158484
C  -0.845832 1.339324 -0.362221
C  -1.041871 -2.411992 0.170429
C  -2.809557 -0.649331 0.149842
C  0.294796 -2.796634 0.062398
C  -3.200285 0.696652 0.014419
C  -2.187549 1.686997 -0.252552
C  2.997222 0.687783 2.270182
H  2.369051 -2.092783 -0.24345
H  -0.107576 2.10269 -0.630511
H  -1.816166 -3.167096 0.349893
H  -3.563613 -1.424448 0.334604
H  0.577592 -3.850562 0.150125
H  -2.489785 2.732556 -0.389542
H  1.746677 2.155499 1.331665
H  3.871136 0.104816 1.935106
H  2.207068 -0.007256 2.625839
H  3.321078 1.326846 3.110749
H  -4.795764 2.065114 -0.003349
H  -5.266842 0.413039 0.289181
