program: Gaussian 09
title: 000004805
version: EM64L-G09RevD.01
frameworkgroup: C1[X(C13H13NO7)]
method: RPBEPBE
basis: SDD
operation: Freq
keyword: #p
keyword: freq=noraman
keyword: PBEPBE/SDD
title: #p freq=noraman PBEPBE/SDD
converged: YES YES NO NO
title: Mulliken charges:
elementType: O O O O O O O N C C C C C C C C C C C C C H H H H H H H H H H H H H
charge: -0.397325 -0.239343 -0.242079 -0.418985 -0.232401 -0.432370 -0.249536 -0.398095 -0.134120 -0.393958 -0.505455 0.116980 0.134995 0.197363 0.101504 0.183061 -0.353749 -0.327959 -0.214942 -0.220798 0.105462 0.302179 0.287524 0.249139 0.251433 0.314313 0.350435 0.255343 0.278872 0.239138 0.240039 0.389969 0.374341 0.389027
chargesum: 0.00000
title: Mulliken charges with hydrogens summed into heavy atoms:
elementType: O O O O O O O N C C C C C C C C C C C C C
charge: -0.007356 -0.239343 -0.242079 -0.044644 -0.232401 -0.043342 -0.249536 -0.047659 0.168058 0.142705 0.060292 0.116980 0.134995 0.197363 0.101504 0.183061 -0.098407 -0.049088 0.024196 0.019241 0.105462
polarizability: 2.09367226e+02 -6.45306298e+00 1.76744211e+02 -1.82316908e+01 7.58715519e-03 1.18868721e+02
1716.lowfreq: -11.6916 -4.0304 -0.0004 0.0002 0.0004 4.8593 12.4043 20.4190 32.7569
frequency: 11.4885 20.4135 32.7307 37.2050 52.8479 56.1168 74.7127 86.1626 115.8295 118.6645 129.3429 149.3985 185.9594 197.8914 212.3230 251.7603 272.6736 312.1280 337.9417 385.3771 408.0942 420.1304 431.1343 498.3652 506.0159 516.2259 552.9078 571.1443 587.6987 593.5164 598.4086 618.2426 636.5387 637.9996 651.6883 690.2397 712.4731 724.9310 755.3258 772.6683 776.1761 792.9067 817.2668 878.3567 895.9375 897.6168 932.8792 973.1957 1004.4773 1008.3065 1023.5017 1037.2448 1046.3206 1063.1454 1092.4213 1097.6476 1121.6916 1159.8888 1164.0428 1179.4989 1189.8975 1228.5423 1240.9258 1256.9642 1269.6512 1281.2330 1295.8241 1323.2433 1333.9900 1359.2085 1378.7603 1384.5320 1427.1532 1445.2279 1465.8395 1470.7198 1492.4540 1578.9917 1588.6023 1601.9032 1637.2225 1648.0786 1668.4735 2993.6416 3010.4500 3035.8369 3049.4682 3101.9742 3135.5064 3148.8196 3164.0843 3181.3886 3508.8576 3514.6300 3518.7615 3529.5461
redmass: 6.8681 11.4840 8.1357 8.7827 7.6767 7.9262 8.6763 6.3287 3.9527 4.9540 3.5231 6.9410 6.2755 6.3990 3.5309 7.0550 7.0501 4.7613 6.0060 6.4778 3.4813 4.6351 4.8157 3.9393 1.9162 4.3768 3.8021 2.6644 2.8753 1.4354 4.6319 1.2334 1.5039 1.5413 4.3424 3.8907 5.3825 4.8917 5.4882 1.9824 1.9501 2.2047 3.4388 3.8377 3.9170 1.5389 2.8115 1.4054 1.3543 5.1989 3.0248 2.6441 2.5497 2.1848 2.6050 2.5514 2.0673 2.1566 1.8884 1.0747 1.2797 1.3503 1.4129 1.7373 1.5125 1.6488 1.1836 2.6399 1.4642 2.3735 10.2990 1.7662 2.1485 1.0964 1.2642 1.7776 2.6384 7.0374 9.0553 6.3164 8.6246 8.4480 8.1000 1.0613 1.0816 1.0628 1.0967 1.1035 1.0864 1.0913 1.0965 1.0976 1.0782 1.0639 1.0643 1.0642
irintensity: 0.0384 0.5276 1.2775 2.0398 1.8845 1.1973 0.3776 1.3158 1.2572 3.3568 2.5077 4.3330 7.7883 3.2586 1.1429 2.0375 1.2094 0.5086 10.7923 8.7888 11.4671 25.1262 35.2307 29.3505 23.5292 4.1599 70.5706 102.6315 18.1559 70.2693 38.6018 11.8889 146.8055 101.5078 17.3435 62.3214 41.0448 7.6229 5.6315 55.4239 30.7829 22.0920 19.9320 7.9933 13.7955 1.3029 7.4999 5.7773 2.7529 208.4566 177.3416 13.6913 207.5631 143.1742 41.6212 34.8986 63.2918 19.6040 51.7970 0.4681 6.7450 4.5034 8.1190 16.5216 8.9041 3.4841 11.8282 82.9214 53.3393 135.8860 11.4320 64.1983 1.4883 17.4646 62.3054 114.7211 161.7274 38.0240 206.3497 19.1295 321.1747 159.3727 214.6072 28.3421 11.7378 12.9388 11.1305 4.3499 0.8337 9.8555 15.7409 9.3189 77.9884 20.0680 35.0964 49.1873
temp: 298.150 k
press: 1.00000 atm
elementType: 8 8 8 8 8 8 8 7 6 6 6 6 6 6 6 6 6 6 6 6 6 1 1 1 1 1 1 1 1 1 1 1 1 1
symmnumber: 1
zpe: 654044.1 jmol-1
zpe.correction: 0.249112 hartree
zpe.thermalcorrener: 0.269621 hartree
zpe.thermalcorrenthalpy: 0.270565 hartree
zpe.thermalcorrgfe: 0.195633 hartree
zpe.sumelectzpe: -1083.006485 hartree
zpe.sumelectthermal: -1082.985976 hartree
zpe.sumelectthermalent: -1082.985032 hartree
zpe.sumelectthermalfe: -1083.059964 hartree
dipole: 1.8153 -1.3884 -3.6646
dipole: 4.3189
quadrupole: -101.0985 -99.8708 -136.4701
quadrupole: 4.7155 2.0842 -5.3518
quadrupole: 11.3813 12.6090 -23.9903 4.7155 2.0842 -5.3518
hfenergy: -1083.2555974 hartree
pointgroup: C01 [X(C13H13N1O7)]
dipole: -0.7206418 0.4999678 -1.455307 debye
polarizability: 209.2419366|-3.9163568|175.8691533|20.3935227|1.9735358|119.8690677 unknown
InChI: InChI=1S/C13H13NO7/c15-10(16)6-5-9(13(20)21)14-11(17)7-3-1-2-4-8(7)12(18)19/h1-4,9,14-15,18,20H,5-6H2
charge 0 multiplicity 1
34 atoms
O  3.3774 3.092923 0.016816
O  1.763839 2.784661 -1.624758
O  -0.511513 0.359416 2.035429
O  3.893984 -2.425706 -1.282789
O  4.17597 -1.963255 0.973667
O  -2.15937 -3.343378 -0.257595
O  -0.269087 -2.012075 -0.121236
N  0.236377 1.234107 0.014036
C  1.563158 1.592367 0.533132
C  2.477004 0.360583 0.824268
C  2.686021 -0.538668 -0.406975
C  2.203651 2.53618 -0.47776
C  -0.704018 0.615874 0.807298
C  -2.044186 0.348585 0.141845
C  -2.478033 -0.960547 -0.221213
C  3.643635 -1.674648 -0.120353
C  -2.948949 1.429198 0.01875
C  -3.806392 -1.165786 -0.675885
C  -4.265665 1.221367 -0.450324
C  -4.698217 -0.08045 -0.791474
C  -1.519685 -2.099047 -0.183422
H  1.442436 2.131848 1.492555
H  1.99682 -0.216725 1.631481
H  3.442794 0.730634 1.210274
H  3.077537 0.018696 -1.280221
H  1.723497 -0.98475 -0.720811
H  0.052798 1.423843 -0.976346
H  -2.625505 2.433969 0.311113
H  -4.11946 -2.178821 -0.941963
H  -4.951422 2.070778 -0.539329
H  -5.720359 -0.246839 -1.146727
H  3.785317 3.687374 -0.669634
H  4.514143 -3.171024 -1.055646
H  -1.469422 -4.059885 -0.241606
