program: Gaussian 09
title: 000070632
version: EM64L-G09RevD.01
frameworkgroup: C1[X(C6H6N4O)]
method: RPBEPBE
basis: SDD
operation: Freq
keyword: #pfreq=noraman
keyword: PBEPBE/SDD
title: #p freq=noraman PBEPBE/SDD
converged: NO NO NO NO
title: Mulliken charges:
elementType: O N N N N C C C C C C H H H H H H
charge: -0.269480 -0.383122 -0.028846 0.035637 -0.055599 0.130460 -0.079730 0.169500 -0.214044 -0.372760 -0.501330 0.330914 0.266936 0.249190 0.231153 0.245563 0.245559
chargesum: 0.00000
title: Mulliken charges with hydrogens summed into heavy atoms:
elementType: O N N N N C C C C C C
charge: -0.269480 -0.052208 -0.028846 0.035637 -0.055599 0.130460 -0.079730 0.169500 0.052892 -0.123571 0.220944
polarizability: 1.26692480e+02 -5.17066116e+00 1.06431016e+02 -8.29231311e-04 -1.19089593e-03 4.31838702e+01
1716.lowfreq: -0.0005 -0.0003 0.0007 8.2102 11.2632 15.2279 94.7826 124.9578 180.1466
frequency: 94.7119 124.9530 180.1398 184.0986 223.9085 299.9544 339.2907 481.6517 530.9010 570.1584 602.9570 633.8368 637.3819 669.8619 698.1902 790.9658 820.9966 839.7752 905.7329 914.2971 924.8121 1050.7998 1080.6005 1115.8700 1123.2757 1161.4566 1224.0701 1259.6744 1295.1706 1314.7175 1342.8564 1353.6494 1407.5283 1434.1274 1437.1215 1448.1745 1466.9323 1504.8616 1615.1410 3004.0693 3106.1919 3145.8921 3171.9053 3236.1540 3591.4094
redmass: 3.5906 1.1190 3.8339 4.3283 6.7186 6.1041 4.2124 7.4918 9.4125 3.8613 4.3540 7.0893 1.4027 3.6646 6.7491 7.0541 9.4689 1.5400 7.7960 8.0122 1.4348 2.7115 3.5632 1.2530 2.3682 1.9009 2.2146 7.2395 3.4569 3.8750 3.7243 2.7831 1.6190 2.5003 1.6124 1.0502 1.0515 6.9543 9.2899 1.0292 1.1044 1.1053 1.0923 1.0990 1.0825
irintensity: 0.8233 1.0172 7.6506 20.4163 0.5603 1.7839 1.8114 3.6828 2.6488 1.7553 48.7159 10.6810 72.8762 18.8749 10.6070 0.5071 17.0212 19.2922 5.2612 8.7327 16.2661 89.0764 41.1081 0.0809 11.8647 3.1213 9.3546 37.4303 53.9429 40.7407 202.3113 57.6592 7.1395 36.7346 26.5446 14.1657 29.7217 160.3142 149.5841 43.0220 24.6612 19.0734 14.8937 1.0521 67.2905
temp: 298.150 k
press: 1.00000 atm
elementType: 8 7 7 7 7 6 6 6 6 6 6 1 1 1 1 1 1
symmnumber: 1
zpe: 325146.3 jmol-1
zpe.correction: 0.123842 hartree
zpe.thermalcorrener: 0.132506 hartree
zpe.thermalcorrenthalpy: 0.133450 hartree
zpe.thermalcorrgfe: 0.089860 hartree
zpe.sumelectzpe: -525.664833 hartree
zpe.sumelectthermal: -525.656168 hartree
zpe.sumelectthermalent: -525.655224 hartree
zpe.sumelectthermalfe: -525.698815 hartree
dipole: -3.2433 -5.1977 0.0001
dipole: 6.1265
quadrupole: -63.3799 -57.8698 -64.1126
quadrupole: -9.7312 0.0004 0.0000
quadrupole: -1.5925 3.9176 -2.3251 -9.7312 0.0004 0.0000
hfenergy: -525.7886743 hartree
pointgroup: C01 [X(C6H6N4O1)]
dipole: 1.2869445 -2.0380447 -0.0000461 debye
dipolederiv: -1.4537256 0.3717625 0.000023 0.7331884 -0.6730253 -0.0000135 0.0000148 -0.0000084 -0.3227336 -0.4288 0.1229405 0.00001 -0.0517213 -0.6046496 0.0000006 -0.0000109 0.0000088 -0.2318954 -0.3807796 -0.2084339 -0.0000069 -0.0207779 -0.6113379 0.0000019 0.0000018 -0.0000131 -0.2652138 -0.509213 -0.1189432 0.0000032 0.0377546 -0.4940972 -0.0000044 0.0000029 -0.0000093 -0.1976211 -0.5682764 -0.0131294 0.0000074 0.3350308 -0.83516 -0.0000177 0.0000092 -0.0000076 -0.1834212 -0.7357499 0.2713454 0.0000046 0.3583053 0.2516336 -0.0000106 0.0000176 0.0000036 0.0685604 0.5956637 0.4194258 0.0000025 -0.0627871 0.4454763 0.0000066 0.0000018 0.0000071 0.0740449 1.4305351 -0.4446484 -0.0000192 -0.8311299 0.9122741 0.0000188 -0.0000264 0.0000129 0.2064081 0.4264573 -0.2855517 0.0000038 -0.2910491 0.4940299 0.0000113 -0.0000149 -0.0000044 -0.0388928 0.5116222 -0.0163524 -0.0000142 -0.1162001 0.6196005 0.0000183 -0.0000086 0.0000176 -0.0720206 0.8468103 -0.1139872 -0.0000197 0.0413686 0.2348567 -0.0000078 -0.0000073 -0.0000105 0.2682186 0.1672002 0.010118 -0.0000011 0.017053 0.2417386 -0.0000034 -0.0000028 -0.0000053 0.3659649 0.0758663 -0.0546254 -0.0000021 -0.0552039 0.0343443 -0.0000045 0.0000126 0.000007 0.1798943 0.0658191 -0.0546076 0.0000004 -0.034634 -0.068651 -0.0000036 -0.0000006 -0.000005 0.1330547 -0.0088213 0.070895 -0.000003 0.1449746 -0.0683125 0.0000152 -0.000006 0.0000147 0.1240577 -0.017295 0.0218953 -0.0037413 -0.1020886 0.0606306 -0.0965106 -0.0515995 -0.0759789 -0.0541866 -0.0173135 0.0218968 0.0037527 -0.1020833 0.060649 0.0965031 0.0516162 0.0759707 -0.0542186 unknown
polarizability: 126.6364507|5.2789998|106.4870455|-0.0008356|0.0011864|43.1838702 unknown
InChI: InChI=1S/C6H6N4O/c1-11-6-4-5(8-2-7-4)9-3-10-6/h2-3,7H,1H3
charge 0 multiplicity 1
17 atoms
O  2.02149 -1.157715 -0.000034
N  -1.021596 -1.693473 0.0000
N  -2.567005 0.002207 0.00004
N  -0.923261 1.877618 0.000057
N  1.425726 1.153443 -0.000007
C  -0.292251 -0.505227 0.00001
C  -1.267501 0.549548 0.00003
C  1.075539 -0.152204 -0.000008
C  -2.373737 -1.327842 -0.000024
C  0.415483 2.095856 0.000031
C  3.43894 -0.732787 -0.000047
H  -0.635854 -2.636887 -0.000007
H  -3.173226 -2.066114 -0.000039
H  0.743281 3.139173 0.000053
H  4.007436 -1.673767 0.000025
H  3.658958 -0.12995 0.897021
H  3.658979 -0.130079 -0.897199
