program: Gaussian 09
title: 000070635
version: EM64L-G09RevD.01
frameworkgroup: C1[X(C11H14)]
method: RPBEPBE
basis: SDD
operation: Freq
keyword: #p
keyword: freq=noraman
keyword: PBEPBE/SDD
title: #p freq=noraman PBEPBE/SDD
converged: NO NO NO NO
title: Mulliken charges:
elementType: C C C C C C C C C C C H H H H H H H H H H H H H H
charge: -0.446033 -0.549944 -0.549942 0.306491 0.306485 -0.634814 -0.634814 0.344912 0.344887 -0.820502 -0.820480 0.214333 0.221062 0.221359 0.222482 0.222484 0.221358 0.241153 0.241152 0.228745 0.222673 0.222772 0.228741 0.222780 0.222661
chargesum: 0.00000
title: Mulliken charges with hydrogens summed into heavy atoms:
elementType: C C C C C C C C C C C
charge: -0.010639 -0.106103 -0.106100 0.306491 0.306485 -0.393661 -0.393662 0.344912 0.344887 -0.146313 -0.146298
polarizability: 1.54663440e+02 -4.12440132e-04 1.20559992e+02 1.57661208e+00 2.26068475e-04 6.95032896e+01
1716.lowfreq: -0.0007 -0.0003 0.0005 7.5577 13.5399 25.2974 115.2130 118.3431 130.3103
frequency: 115.2114 118.3423 130.2861 170.2443 209.2359 258.9107 275.7751 291.7265 337.3785 421.2214 433.5149 448.7948 540.1204 580.7215 610.8859 701.4433 732.0961 733.0002 791.1453 853.2702 872.3327 878.2125 904.7852 912.4647 986.8015 997.0717 1017.9335 1027.6776 1048.6341 1052.7067 1056.0341 1121.5542 1146.7618 1179.0351 1198.0316 1207.8446 1259.5492 1268.0018 1281.0389 1293.3412 1312.6895 1374.7867 1393.4692 1406.7773 1407.6474 1458.1646 1459.3176 1464.0226 1475.2965 1476.5152 1478.9309 1479.6286 1491.7749 1584.6165 1627.5420 2965.2465 2966.4165 2973.0258 2973.6315 2997.6394 3037.4566 3041.3482 3042.3106 3043.8567 3070.6568 3072.7694 3075.4191 3111.4447 3114.9018
redmass: 2.5610 1.6211 1.3525 1.1408 1.7152 2.6241 3.0632 2.4894 2.9648 3.8195 2.7251 4.2805 3.2530 3.2181 2.0630 3.4672 4.6951 3.8124 2.5724 2.4344 1.3615 1.3777 1.4106 2.1756 1.9817 1.3752 1.7618 1.4407 1.6623 1.6341 4.6996 1.2152 1.7281 1.3853 2.4248 1.3151 1.2443 1.6998 1.2529 6.2137 1.3973 5.2830 1.2371 1.2584 3.7820 1.0864 1.1444 1.0469 1.2032 1.1234 1.0458 1.1203 2.6034 7.3191 7.1584 1.0370 1.0377 1.0646 1.0638 1.0651 1.0972 1.0971 1.0978 1.0942 1.1039 1.0988 1.0979 1.0911 1.0915
irintensity: 3.0195 0.0058 0.0048 1.1142 2.7371 0.0316 1.6662 0.2018 0.2169 0.2980 9.7098 1.3513 0.0074 0.1251 2.4503 0.0823 0.4605 0.0127 1.5366 0.5821 0.1515 26.2939 0.0589 4.8001 1.0171 14.5927 1.0870 11.8319 7.7017 0.0002 0.0045 1.7437 0.2963 0.1009 1.8227 3.7785 0.7337 0.6459 1.7954 0.0384 2.4149 1.5014 6.2078 16.9406 0.1353 8.5784 5.7622 0.0165 28.5508 3.4099 29.0971 2.5213 31.7762 0.0896 0.3480 79.9923 14.3403 30.5582 50.0947 38.6663 48.9813 0.0631 21.8912 46.3237 62.7861 39.5498 6.3618 41.6667 0.2158
temp: 298.150 k
press: 1.00000 atm
elementType: 6 6 6 6 6 6 6 6 6 6 6 1 1 1 1 1 1 1 1 1 1 1 1 1 1
symmnumber: 1
zpe: 567271.8 jmol-1
zpe.correction: 0.216062 hartree
zpe.thermalcorrener: 0.226370 hartree
zpe.thermalcorrenthalpy: 0.227314 hartree
zpe.thermalcorrgfe: 0.180947 hartree
zpe.sumelectzpe: -426.770480 hartree
zpe.sumelectthermal: -426.760172 hartree
zpe.sumelectthermalent: -426.759228 hartree
zpe.sumelectthermalfe: -426.805595 hartree
dipole: 0.0582 0.0000 -0.0501
dipole: 0.0768
quadrupole: -60.3446 -62.7120 -69.0172
quadrupole: -0.0002 0.3989 0.0000
quadrupole: 3.6800 1.3126 -4.9926 -0.0002 0.3989 0.0000
hfenergy: -426.9865421 hartree
pointgroup: C01 [X(C11H14)]
dipole: 0.0228727 0.000015 0.0197515 debye
dipolederiv: 0.1191049 -0.0000015 -0.060333 -0.0000056 -0.0104549 -0.0000016 0.0278623 0.0000033 0.1485254 -0.0153397 -0.0289204 -0.0114492 0.0268291 0.0492401 -0.0299759 0.0356359 -0.0365332 0.1699901 -0.0153439 0.0289163 -0.0114459 -0.0268271 0.0492514 0.0299823 0.0356456 0.0365431 0.1699857 0.0964269 -0.1083766 -0.0106038 -0.2890716 -0.0341142 0.0001483 -0.0817687 0.0280909 -0.0554416 0.096414 0.1083814 -0.0106166 0.28907 -0.034085 -0.0001539 -0.08178 -0.0281048 -0.0554367 -0.1230786 -0.007747 -0.0048168 0.0410573 0.0814517 0.0040622 0.0102907 0.0004257 -0.1853402 -0.1230839 0.0077357 -0.00481 -0.0410645 0.0814495 -0.0040564 0.010298 -0.0004278 -0.1853392 0.1408384 0.1489167 -0.005514 0.2640448 0.0080393 -0.0085355 0.0015357 -0.0093622 -0.0510969 0.1408539 -0.1489085 -0.0055333 -0.2640379 0.0080158 0.0085398 0.0014432 0.0094063 -0.0510938 -0.1058237 -0.0958444 0.0045811 -0.033404 0.0640173 0.0014353 0.0028875 0.0033668 0.0734386 -0.1058504 0.0958484 0.0045874 0.033415 0.0640199 -0.0014491 0.0029671 -0.0034303 0.0734389 -0.2267175 -0.0000043 0.0674968 -0.0000003 0.0678842 0.0000014 0.1118574 0.000002 0.0520066 0.0838468 0.0000015 -0.0085758 0.0000011 0.0410806 -0.0000014 -0.0918559 -0.0000042 -0.1756888 -0.0409568 0.0449357 0.0403362 0.0187461 0.0400264 -0.0597648 0.0803736 -0.111549 -0.1249188 0.0151145 0.0204848 -0.0128241 0.0582839 -0.1052894 0.092263 -0.0698798 0.1287457 0.016622 0.0151188 -0.0204802 -0.0128214 -0.0582829 -0.1053064 -0.0922595 -0.069875 -0.128744 0.0166356 -0.0409542 -0.0449389 0.0403321 -0.0187442 0.0400317 0.0597584 0.0803657 0.1115461 -0.1249295 0.0720508 -0.0080113 0.0013142 -0.011629 -0.133345 -0.0005262 -0.004983 0.0023826 0.1451036 0.0720498 0.0080294 0.0013104 0.0116417 -0.1333454 0.0005277 -0.004984 -0.0023748 0.1451038 0.0780331 0.0949443 0.0002843 -0.0282054 -0.1583086 0.0016645 0.0006895 -0.0015687 0.1053624 -0.0582937 -0.0254988 -0.0937043 0.0119657 0.0698593 0.0723927 -0.1428934 0.0215531 -0.0477396 -0.0470912 -0.0258665 0.0931038 0.0101015 0.0691632 -0.0742965 0.1441967 -0.0207515 -0.0584041 0.0780417 -0.0949392 0.000315 0.0282133 -0.1583008 -0.001585 0.0006803 0.0016525 0.1053571 -0.0470456 0.0258998 0.0930851 -0.0100561 0.0691786 0.0742657 0.1441775 0.020727 -0.0584714 -0.0583142 0.0254437 -0.093698 -0.0120411 0.0698407 -0.0724355 -0.1428869 -0.0215945 -0.0476695 unknown
polarizability: 154.6680746|0.0012537|120.5599919|-1.4460292|0.0002613|69.498655 unknown
InChI: InChI=1S/C11H14/c1-8-6-10-4-3-5-11(10)7-9(8)2/h6-7H,3-5H2,1-2H3
charge 0 multiplicity 1
25 atoms
C  -3.170202 -0.00008 -0.303179
C  -2.318585 1.241547 0.114985
C  -2.318545 -1.241645 0.115018
C  -0.889658 0.70848 0.052808
C  -0.889634 -0.708538 0.05282
C  0.329453 1.414296 0.027934
C  0.329521 -1.414285 0.027941
C  1.565121 0.71517 -0.00419
C  1.565141 -0.715092 -0.00419
C  2.874179 1.487243 -0.040531
C  2.874252 -1.487117 -0.040578
H  -4.179136 -0.000084 0.146195
H  -3.293595 -0.000092 -1.403082
H  -2.564915 1.555847 1.149594
H  -2.48861 2.113185 -0.542674
H  -2.488543 -2.113328 -0.54259
H  -2.564846 -1.55591 1.149646
H  0.333305 2.511759 0.027667
H  0.333444 -2.511749 0.027684
H  2.694003 2.576581 -0.040927
H  3.511834 1.252593 0.833917
H  3.468456 1.245265 -0.943029
H  2.694111 -2.576456 -0.040602
H  3.468276 -1.245346 -0.943293
H  3.512074 -1.252145 0.833656
