program: Orca
programVersion: 5.0.4
elementType: C H H H H
charge: 0
multiplicity: 1
keywords: Opt RIJCOSX PBEh-3c
formula: CH4
InChI: InChI=1/CH4/h1H4
5 atoms
C  -4.52012 2.7921 -0.007446
H  -3.48222 3.058303 -0.188022
H  -5.035283 3.632414 0.449969
H  -4.563651 1.934332 0.65807
H  -4.999536 2.543391 -0.950421
totalener: -40.42706806 hartree
nucrepener: 13.40833246 hartree
electener: -53.83540052 hartree
oneelecener: -79.76179474 hartree
twoeener: 25.92639422 hartree
kineticenergy: 40.05120491 hartree
exchangeener: -3.649951099594 hartree
correlationener: -0.398758276611 hartree
xcener: -4.048709376205 hartree
dispersion: -0.000682617 hartree
dispersion: -0.000682784 hartree
energy: -283.3705 -21.0967 -12.1208 -12.1195 -12.1185 4.7619 5.9668 5.9677 5.9685 13.8100 13.8109 13.8127 28.2568 28.2586 28.2608 29.0273 29.9266 46.6093 46.6114 63.0881 63.0884 63.0902 372.7718 electronvolt
chargesum: 0.0000000
charge: -0.881136 0.220252 0.220290 0.220320 0.220275
charge: -0.522624 0.130640 0.130661 0.130664 0.130660
qa: -0.8811 0.2203 0.2203 0.2203 0.2203
va: 3.7476 0.9164 0.9164 0.9163 0.9164
dispersion: -0.000682780 hartree
energy: -40.426628210780 hartree
dipole: -0.00015 0.00006 -0.00009 0.00003 -0.00007 -0.00004 -0.00043 0.00034 -0.00009
magnitude: 0.00013 au
magnitude: 0.00034 debye
