program: Orca
programVersion: 5.0.4
elementType: C H H H H
charge: 0
multiplicity: 1
keywords: SP M062X aug-cc-pVDZ def2-TZVP/C def2/J TightSCF
keywords: NoFrozenCore
formula: CH4
InChI: InChI=1/CH4/h1H4
5 atoms
C  0.000013 -0.000003 0.000039
H  1.037913 0.266201 -0.180537
H  -0.51515 0.840312 0.457454
H  -0.043518 -0.85777 0.665555
H  -0.479403 -0.248711 -0.942936
totalener: -40.48429047 hartree
nucrepener: 13.47724537 hartree
electener: -53.96153584 hartree
oneelecener: -79.85918826 hartree
twoeener: 25.89765243 hartree
kineticenergy: 40.16642825 hartree
xcener: -3.316146391180 hartree
energy: -286.4353 -21.3892 -12.3723 -12.3713 -12.3688 0.0698 0.9097 0.9098 0.9099 2.7398 2.7401 2.7404 3.5671 5.9131 5.9141 5.9145 6.5037 6.5043 9.0398 9.8551 9.8552 9.8557 12.1259 12.1264 12.1266 12.9046 13.8646 13.8662 13.8666 16.0057 16.0064 16.0076 16.8634 16.8636 22.3592 22.3652 22.3662 25.8272 31.7638 31.7667 31.7708 42.1959 42.2027 45.6660 45.6670 45.6695 48.5500 53.8083 53.8098 53.8123 55.3753 55.3781 55.3805 64.3717 64.3743 68.7703 71.2574 71.2695 71.2716 electronvolt
chargesum: 0.0000000
charge: 1.091975 -0.273452 -0.273249 -0.273184 -0.272090
charge: 0.269191 -0.067284 -0.067313 -0.067327 -0.067266
qa: 1.0920 -0.2735 -0.2732 -0.2732 -0.2721
va: 3.6904 0.7608 0.7610 0.7605 0.7613
energy: -40.484290468804 hartree
dipole: -0.00015 0.00002 -0.00013 0.00003 -0.00025 -0.00022 -0.00043 0.00039 -0.00005
magnitude: 0.00026 au
magnitude: 0.00066 debye
