program: Gaussian 09
title: 000070647
version: EM64L-G09RevD.01
frameworkgroup: C1[X(C10H12O2S)]
method: RPBEPBE
basis: SDD
operation: Freq
keyword: #p
keyword: freq=noraman
keyword: PBEPBE/SDD
title: #p freq=noraman PBEPBE/SDD
converged: YES YES NO NO
title: Mulliken charges:
elementType: S O O C C C C C C C C C C H H H H H H H H H H H H
charge: 0.868551 -0.557881 -0.553991 -0.415565 -0.577437 -0.504302 0.530376 -0.287514 -0.562608 -0.239411 0.461452 -0.357636 -0.804691 0.229826 0.272237 0.264856 0.292306 0.230297 0.239757 0.243188 0.281828 0.245246 0.235292 0.239175 0.226650
chargesum: 0.00000
title: Mulliken charges with hydrogens summed into heavy atoms:
elementType: S O O C C C C C C C C C C
charge: 0.868551 -0.557881 -0.553991 0.086498 -0.020276 -0.034247 0.530376 -0.287514 -0.319420 0.042417 0.461452 -0.112391 -0.103573
polarizability: 1.75334816e+02 3.73426992e+00 1.41248121e+02 -5.00628860e-01 1.18603641e+00 8.90358158e+01
1716.lowfreq: -6.0694 0.0009 0.0018 0.0024 10.4575 10.9344 50.7321 52.4370 75.2046
frequency: 50.7252 52.3226 75.1972 157.7317 177.9927 182.8812 206.6639 250.2247 271.7881 288.8013 346.9217 376.7446 379.9962 393.8807 446.1706 461.2617 521.3108 554.9316 598.5190 607.9894 703.6846 718.8836 793.5681 824.9708 842.0244 861.1474 893.1651 905.6790 917.6469 945.6419 967.2833 1002.0484 1009.9348 1032.1507 1050.4799 1077.7657 1120.4539 1145.5917 1176.5950 1180.6745 1243.2021 1245.9249 1265.9507 1283.9740 1339.1017 1363.3138 1382.1027 1397.6812 1404.0791 1417.7017 1450.3488 1462.9014 1468.9771 1471.1500 1482.6814 1585.2554 1610.3712 2967.4543 2982.3848 2994.1138 3035.9430 3044.5209 3055.4376 3062.8470 3089.0628 3113.2592 3135.5824 3141.0269 3157.5250
redmass: 3.2666 1.1223 3.8583 5.3892 3.5007 5.6485 3.3513 6.0800 4.0258 2.1668 4.6034 4.9505 4.5218 4.5227 2.8962 3.8740 2.8993 4.0047 4.8782 4.4813 4.1861 3.5695 11.0048 1.3282 1.6005 2.8228 2.2486 1.8034 3.3003 2.3336 1.3589 1.6528 3.9826 1.7652 1.5787 1.9122 1.2277 1.5255 1.6534 1.2766 1.8212 1.5956 1.4767 1.2502 1.5900 1.4169 4.5052 1.8581 1.6380 1.1231 1.2202 1.0784 1.5456 1.1000 1.2984 6.4405 6.2902 1.0656 1.0373 1.0616 1.0930 1.0745 1.0840 1.0975 1.0992 1.0910 1.0884 1.1106 1.0970
irintensity: 2.6653 0.1504 1.3001 3.1217 1.6174 9.8032 4.1657 3.2926 7.2296 3.5083 1.9875 23.1111 25.8302 12.1344 10.4475 4.8013 5.6623 10.6807 44.8068 4.1522 0.1523 1.4611 65.6916 27.5826 17.8189 2.7514 29.0227 25.2626 39.4551 17.9825 0.4797 3.1879 1.1243 16.1812 15.7476 6.5311 0.3835 0.8372 4.3099 3.9027 7.0339 6.8163 5.2668 1.7563 0.6009 0.7377 4.9438 10.8876 5.2054 10.5632 14.4533 21.7765 13.3741 16.7886 20.2513 9.3411 11.8866 18.6118 27.6399 21.2058 19.8625 0.6691 13.9287 16.3263 15.9399 16.5901 7.5089 2.4779 7.7522
temp: 298.150 k
press: 1.00000 atm
elementType: 16 8 8 6 6 6 6 6 6 6 6 6 6 1 1 1 1 1 1 1 1 1 1 1 1
symmnumber: 1
zpe: 515741.9 jmol-1
zpe.correction: 0.196436 hartree
zpe.thermalcorrener: 0.209153 hartree
zpe.thermalcorrenthalpy: 0.210098 hartree
zpe.thermalcorrgfe: 0.157070 hartree
zpe.sumelectzpe: -935.648957 hartree
zpe.sumelectthermal: -935.636239 hartree
zpe.sumelectthermalent: -935.635295 hartree
zpe.sumelectthermalfe: -935.688323 hartree
dipole: -4.5606 5.4306 -1.6845
dipole: 7.2889
quadrupole: -79.5300 -81.3132 -93.1707
quadrupole: 14.0722 -4.7139 -1.9751
quadrupole: 5.1413 3.3581 -8.4994 14.0722 -4.7139 -1.9751
hfenergy: -935.8453927 hartree
pointgroup: C01 [X(C10H12O2S1)]
dipole: 1.6620676 -2.2501383 -0.6308837 debye
dipolederiv: 1.6474298 -0.1503031 -0.0287951 -0.1509597 1.1940694 0.0076543 -0.0051513 0.0041284 1.2085022 -0.7069283 0.0361769 0.0425694 0.0211165 -0.538198 0.012643 0.1103758 -0.088409 -0.6683071 -0.6773551 0.0569202 -0.0120756 0.0898619 -0.6516352 0.0557308 -0.0777772 0.1523878 -0.5838916 0.0569882 -0.0786065 -0.0071815 -0.032723 -0.076426 0.0250189 -0.0355406 -0.0557516 0.0250726 -0.1102474 0.0608166 0.0129912 0.0571984 -0.0308145 -0.0218614 0.0019687 -0.015988 -0.0589043 0.0406482 -0.008386 -0.0013691 -0.0661595 0.0286804 0.0092401 -0.0397606 -0.0368824 0.1442733 -0.0807788 0.2213145 0.0250598 -0.041763 0.1899991 0.0119289 0.0973495 0.0449205 0.0099125 -0.1136974 -0.0158375 -0.0137152 0.0356736 -0.2359317 -0.0044879 -0.077438 -0.013321 -0.2449939 -0.3075101 -0.1533744 -0.0022824 -0.0916977 0.0105751 0.0033512 -0.0123608 0.0026651 -0.1640588 -0.1163054 -0.0806245 0.012019 0.1719374 0.0093059 0.0006324 0.0128597 -0.0280823 -0.0667444 0.507894 -0.0413874 0.0051169 -0.0265583 0.0431399 -0.0039031 0.0171886 -0.008303 -0.0056145 -0.1616973 0.1480446 -0.0077019 0.1317431 0.0088293 -0.0125391 -0.0141283 -0.0033916 -0.1667707 -0.2093032 0.0181637 -0.0022015 -0.0749836 0.0870273 0.0007813 -0.0208924 0.0022203 0.0525217 0.0077846 -0.0509971 -0.0119309 -0.1258479 -0.1364363 -0.0104305 -0.0240083 0.0056338 0.1159708 0.0564344 0.031291 0.0019458 0.0630955 0.1325495 -0.0683387 0.0242499 0.0065093 -0.0477345 0.0884877 -0.0123121 0.0345214 -0.0239102 -0.0084986 -0.0296343 0.0235604 0.0009048 -0.0622076 -0.0631802 0.021111 -0.0078737 -0.003787 0.0483109 -0.0056068 0.0015236 -0.0089885 0.0882781 0.0109153 -0.0687305 0.0085961 -0.0356029 0.0167379 -0.0546639 0.0265511 -0.1036812 -0.0857222 -0.0059025 0.0597525 -0.0531231 0.0329269 -0.0324226 0.0734984 -0.0320009 0.1151206 0.0279012 0.0243883 0.0614922 0.0018138 0.0788763 -0.0808226 0.0024294 -0.0012136 0.0043531 0.1424702 0.1113456 0.0664401 -0.0016471 0.0188096 0.0375525 0.0001044 0.0088101 0.0141009 0.1432186 -0.033002 -0.0953153 0.0059709 -0.092293 -0.0094725 0.0075117 0.0037818 0.0096094 0.1530736 -0.0108883 -0.0097794 0.0545013 -0.0301064 0.0526246 0.0991436 0.1166498 0.0721275 -0.0259894 -0.0172556 -0.0064787 -0.0559119 -0.016425 0.0703487 -0.0869207 -0.1127261 -0.0643737 -0.0383372 0.0617356 -0.0093905 0.0007032 0.111578 -0.1290923 -0.0112821 0.0081288 -0.0075092 0.1080817 unknown
polarizability: 175.5922395|1.8405145|140.8047575|-1.9476996|-3.0341345|89.2217556 unknown
InChI: InChI=1S/C10H12O2S/c1-8-4-5-10-9(7-8)3-2-6-13(10,11)12/h4-5,7H,2-3,6H2,1H3
charge 0 multiplicity 1
25 atoms
S  -1.956222 0.854021 0.085239
O  -2.412556 1.008664 1.652126
O  -2.258061 2.067579 -0.970674
C  -2.056324 -1.913499 0.321731
C  -2.703151 -0.81677 -0.530143
C  -0.563135 -2.133587 -0.013828
C  0.339552 -0.899937 0.023809
C  -0.111893 0.437834 0.006368
C  1.748816 -1.0823 0.006604
C  0.754173 1.546251 -0.049671
C  2.66042 -0.001476 -0.028933
C  2.143054 1.322213 -0.066206
C  4.158936 -0.242804 -0.032619
H  -2.607612 -2.858826 0.158496
H  -2.184962 -1.647805 1.389061
H  -2.466422 -0.856991 -1.605642
H  -3.783571 -0.6928 -0.357566
H  -0.490589 -2.572512 -1.030971
H  -0.151233 -2.893183 0.676459
H  2.139045 -2.108639 0.019844
H  0.340276 2.559009 -0.097224
H  2.830363 2.174767 -0.109234
H  4.640522 0.247987 -0.898394
H  4.630656 0.170721 0.878322
H  4.399319 -1.318616 -0.076556
