program: Orca
programVersion: 6.0.0
elementType: C H H H H
charge: 0
multiplicity: 1
keywords: SP revDSD-PBEP86/2021 def2-QZVP def2-TZVP/C def2/J TightSCF D3BJ
keywords: NoFrozenCore
formula: CH4
InChI: InChI=1/CH4/h1H4
5 atoms
C  0.000001 0.000016 0.000008
H  1.037943 0.266124 -0.180468
H  -0.515115 0.840213 0.457614
H  -0.043501 -0.857742 0.665659
H  -0.479336 -0.248789 -0.942895
totalener: -40.33790234832504 hartree
nucrepener: 13.47735032540294 hartree
electener: -53.81523215489482 hartree
oneelecener: -79.86530550311950 hartree
twoeener: 26.05007334822469 hartree
kineticenergy: 40.21264715128316 hartree
exchangeener: -2.026322495003 hartree
correlationener: -0.138701688286 hartree
xcener: -2.165024183290 hartree
energy: -293.6623 -23.1555 -13.2948 -13.2944 -13.2934 2.1754 4.2336 4.2338 4.2344 4.9566 4.9569 4.9570 11.5285 11.5292 11.5303 11.6507 electronvolt
chargesum: -0.0000000
charge: -0.286613 0.072088 0.071716 0.071897 0.070912
charge: 0.323861 -0.080946 -0.080988 -0.080948 -0.080980
qa: -0.2866 0.0721 0.0717 0.0719 0.0709
va: 3.9280 1.0032 1.0039 1.0035 1.0037
total: -40.466071822 hartree
dispersion: -0.000841915 hartree
energy: -40.466913737165 hartree
dipole: -0.000007916 0.000244140 0.000236224 -0.000181905 0.000127258 -0.000054647 -0.000085214 0.000217742 0.000132528
dipolemethod: SCF
magnitude: 0.000276318 au
magnitude: 0.000702345 debye
