program: Orca
programVersion: 6.0.0
elementType: C H H H H
charge: 0
multiplicity: 1
keywords: SP revDSD-PBEP86-D4/2021 def2-QZVP def2-TZVP/C def2/J TightSCF
keywords: NoFrozenCore
formula: CH4
InChI: InChI=1/CH4/h1H4
5 atoms
C  0.000001 0.000014 0.000006
H  1.037943 0.266134 -0.180467
H  -0.515112 0.840214 0.457619
H  -0.0435 -0.857736 0.665672
H  -0.47934 -0.248774 -0.9429
totalener: -40.33790231192692 hartree
nucrepener: 13.47731763896337 hartree
electener: -53.81519943559383 hartree
oneelecener: -79.86524383894414 hartree
twoeener: 26.05004440335031 hartree
kineticenergy: 40.21263227115401 hartree
exchangeener: -2.026321338213 hartree
correlationener: -0.138701626967 hartree
xcener: -2.165022965180 hartree
energy: -293.6623 -23.1555 -13.2948 -13.2944 -13.2934 2.1754 4.2336 4.2338 4.2344 4.9566 4.9569 4.9570 11.5285 11.5292 11.5303 11.6507 electronvolt
chargesum: 0.0000000
charge: -0.286614 0.072088 0.071714 0.071898 0.070913
charge: 0.323856 -0.080944 -0.080985 -0.080947 -0.080979
qa: -0.2866 0.0721 0.0717 0.0719 0.0709
va: 3.9280 1.0032 1.0039 1.0035 1.0037
total: -40.466071830 hartree
dispersion: -0.000714764 hartree
energy: -40.466786593553 hartree
dipole: -0.000008590 0.000244722 0.000236132 -0.000152594 0.000102059 -0.000050535 -0.000071566 0.000206028 0.000134462
dipolemethod: SCF
magnitude: 0.000276391 au
magnitude: 0.000702530 debye
