program: Orca
programVersion: 5.0.4
elementType: C H
charge: 0
multiplicity: 2
keywords: SP B2PLYP def2-QZVP def2-TZVP/C def2/J TightSCF
keywords: NoFrozenCore
formula: CH
InChI: InChI=1/CH/h1H
2 atoms
C  0.086756 0.0000 0.0000
H  -1.033795 0.0000 0.0000
totalener: -38.42664384 hartree
nucrepener: 2.83348254 hartree
electener: -41.26012638 hartree
oneelecener: -56.65164633 hartree
twoeener: 15.39151995 hartree
kineticenergy: 38.32378083 hartree
exchangeener: -2.546589597167 hartree
correlationener: -0.143633536582 hartree
xcener: -2.690223133749 hartree
s2: 0.755067
energy: -291.6719 -20.2984 -10.5334 -8.9284 -1.9636 1.9103 4.5982 4.6661 5.1926 6.8686 10.8583 13.0664 13.2192 14.3666 14.4343 19.4624 21.3983 21.8997 22.1802 22.4446 22.7414 26.5653 32.3126 45.7556 45.7975 47.7466 47.7680 48.2559 48.4297 51.5439 52.0172 52.1663 54.4203 55.4885 55.6050 64.4408 65.4096 65.4438 67.6049 67.7327 72.9603 75.7284 76.1484 88.3417 93.5562 93.5726 103.2819 130.5051 130.5285 133.0091 133.0278 136.8722 136.9307 147.8568 149.2955 149.3622 158.0188 158.1478 162.2962 162.4020 162.8675 162.9309 162.9644 164.1521 164.3315 167.3255 167.3296 172.4247 180.5290 180.6330 191.1399 199.8653 199.9074 204.5985 204.6961 206.5322 219.7548 220.2674 220.2765 232.7134 232.8386 259.1942 264.3072 264.4449 321.9627 758.2037 4010.2164 electronvolt
energy: -291.1906 -18.6348 -9.8022 -1.5592 -0.3750 2.0239 4.7258 5.3109 5.8689 7.0783 11.2112 13.2245 13.7850 15.1854 15.2039 19.7055 21.6119 22.1767 22.5802 22.9508 23.9246 26.6786 32.5451 46.2651 46.2826 48.4966 48.6565 48.6812 49.4459 52.0602 53.4804 53.6159 55.0111 55.5506 56.3824 64.8375 65.6811 65.8216 67.5601 67.9077 73.0437 76.3285 77.4501 88.4614 93.6525 94.4623 103.5813 131.2568 131.2637 134.1975 134.2027 137.4520 137.4736 148.1730 149.3752 150.3622 158.0456 159.0335 162.8473 163.3115 163.7858 164.4655 164.4800 165.7144 165.7527 167.4793 167.4812 172.7245 180.7159 181.7701 191.9038 200.1779 200.1796 204.5130 204.8378 206.6630 219.8412 220.2193 220.2367 232.6245 232.8862 259.2075 264.2996 264.9319 322.0972 758.7061 4010.3512 electronvolt
chargesum: -0.0000000
charge: -0.037740 0.037740
charge: 0.242169 -0.242169
qa: -0.0377 0.0377
va: 1.9052 0.9279
total: -38.468495027 hartree
energy: -38.468495027387 hartree
dipole: -0.96988 0.36568 -0.60420 0.00000 -0.00000 -0.00000 0.00000 -0.00000 -0.00000
magnitude: 0.60420 au
magnitude: 1.53576 debye
