program: Gaussian 09
title: 000070620
version: EM64L-G09RevD.01
frameworkgroup: C1[X(C6H10O2)]
method: RPBEPBE
basis: SDD
operation: Freq
keyword: #pfreq=noraman
keyword: PBEPBE/SDD
title: #p freq=noraman PBEPBE/SDD
converged: YES YES NO NO
title: Mulliken charges:
elementType: O O C C C C C C H H H H H H H H H H
charge: -0.195714 -0.195711 -0.355853 -0.355801 -0.446913 -0.446938 -0.065365 -0.065363 0.211437 0.211659 0.211284 0.211788 0.234367 0.234195 0.234268 0.234300 0.172187 0.172172
chargesum: 0.00000
title: Mulliken charges with hydrogens summed into heavy atoms:
elementType: O O C C C C C C
charge: -0.195714 -0.195711 0.067244 0.067271 0.021649 0.021631 0.106822 0.106809
polarizability: 8.28948990e+01 2.27977401e+00 7.14087085e+01 -1.21874147e-02 3.55672459e-03 4.82677873e+01
1716.lowfreq: -47.4434 -9.5756 -8.2540 -0.0011 -0.0007 -0.0004 27.2031 75.6359 77.1472
frequency: 27.2030 75.4582 75.6453 89.3427 160.7026 164.3596 169.1561 310.3323 352.2491 640.9538 655.3829 661.4483 716.7124 750.8686 862.3249 871.0126 913.5075 947.0837 1060.6580 1064.7619 1098.0077 1101.9168 1141.4441 1222.1456 1228.4012 1276.6218 1282.8356 1288.8599 1345.3893 1362.2822 1376.6509 1378.0354 1421.3484 1424.2331 1462.1729 1476.4791 1642.7904 1645.8567 2854.9309 2855.9478 2947.7368 2948.5486 2984.2815 2984.9885 2985.6447 2993.3646 3030.6813 3060.0267
redmass: 6.1598 2.0412 2.3715 5.2390 10.0132 1.8210 1.6752 5.0687 3.5820 6.0134 1.1721 1.1273 4.4787 1.1961 1.2527 3.5806 2.5011 1.2903 2.1474 3.1374 2.8128 1.9699 1.3659 1.3174 1.4211 1.1468 1.0511 1.6060 1.6564 1.6242 1.2205 1.2635 1.0960 1.1048 1.0729 1.0938 7.6005 7.4676 1.0841 1.0839 1.0615 1.0622 1.0610 1.0952 1.0960 1.0595 1.1012 1.1036
irintensity: 13.7906 0.3242 6.8111 13.0211 0.0022 0.0006 2.5474 17.9895 0.0000 0.0318 0.0017 23.5208 11.2029 0.0071 0.0896 27.9741 0.0000 0.0058 2.4909 0.0001 0.0001 0.0029 1.9900 0.0061 56.5334 0.0300 0.0002 0.0001 28.7631 0.0001 13.1540 0.0060 64.4514 0.0079 0.0000 23.1110 238.1753 0.0171 302.9180 3.5501 65.3460 0.0647 0.0157 0.1486 14.8933 44.3151 0.0024 72.6470
temp: 298.150 k
press: 1.00000 atm
elementType: 8 8 6 6 6 6 6 6 1 1 1 1 1 1 1 1 1 1
symmnumber: 1
zpe: 385142.4 jmol-1
zpe.correction: 0.146693 hartree
zpe.thermalcorrener: 0.156428 hartree
zpe.thermalcorrenthalpy: 0.157372 hartree
zpe.thermalcorrgfe: 0.109971 hartree
zpe.sumelectzpe: -384.414841 hartree
zpe.sumelectthermal: -384.405106 hartree
zpe.sumelectthermalent: -384.404162 hartree
zpe.sumelectthermalfe: -384.451563 hartree
dipole: -0.0002 0.0000 0.0152
dipole: 0.0152
quadrupole: -64.9500 -49.1743 -46.4430
quadrupole: -18.6533 0.0101 0.0011
quadrupole: -11.4276 4.3481 7.0794 -18.6533 0.0101 0.0011
hfenergy: -384.5615344 hartree
pointgroup: C01 [X(C6H10O2)]
dipole: -0.0000644 -0.0000551 0.0059669 debye
dipolederiv: -0.6399957 -0.1190729 -0.0009211 -0.2508715 -0.7299306 -0.0041271 -0.00241 -0.0041441 -0.2938355 -0.6399776 -0.1191035 -0.0003266 -0.2508854 -0.7300392 -0.0014628 -0.0005199 -0.001466 -0.2938078 0.0213471 0.0055649 -0.0001061 0.0332212 0.0443856 -0.0012612 -0.0006772 -0.0014861 0.160331 0.0213361 0.0055153 -0.0000855 0.0330991 0.0444137 -0.0010072 0.0006459 -0.000614 0.1603357 -0.4586346 -0.1422382 -0.0004027 -0.2675535 -0.0685692 -0.0017532 0.0002631 -0.0004595 0.1702896 -0.4585941 -0.1422828 -0.0017303 -0.2675868 -0.0685393 -0.0016171 -0.0046841 -0.0026976 0.1702726 1.0615237 0.1517033 -0.0004382 0.1667185 0.9097221 0.0087235 -0.000734 0.0080693 0.0582316 1.0615534 0.1517256 0.0013991 0.1667385 0.9098742 0.002667 0.0017065 0.0031232 0.0581635 0.0514896 -0.0034943 -0.0138465 -0.0002555 -0.0112572 -0.1043135 -0.0228628 -0.1078732 -0.0705595 0.0513582 -0.0051776 0.0147702 -0.0012531 -0.015537 0.1053329 0.0238978 0.1087085 -0.0652837 0.0508684 -0.0035955 -0.0140022 -0.0002079 -0.0109642 -0.1043875 -0.0231323 -0.1079429 -0.0711249 0.0519702 -0.0050245 0.0145818 -0.0012508 -0.0158525 0.1052803 0.0235926 0.1086531 -0.0647284 0.0579898 -0.0180384 0.0092533 0.0625684 0.0245253 0.0958915 0.0044405 0.1279806 -0.0251121 0.0577435 -0.0180686 -0.0098104 0.0625399 0.0269161 -0.0955236 -0.004693 -0.1277427 -0.0279365 0.0582467 -0.018433 -0.0096946 0.0622005 0.0282429 -0.0950765 -0.0034553 -0.1271206 -0.0287095 0.0574309 -0.0176377 0.0093422 0.0629535 0.0231513 0.0963576 0.0056758 0.1286166 -0.0243282 -0.202812 0.148816 0.0017068 0.1949033 -0.1802534 -0.003146 0.0028746 -0.0031603 0.093886 -0.2028436 0.1488419 0.0003109 0.1949217 -0.1802884 -0.0005772 0.0000718 -0.0004441 0.0939162 unknown
polarizability: 82.9485973|2.1394618|71.3540241|0.0220883|0.1511269|48.2687733 unknown
InChI: InChI=1S/C6H10O2/c7-5-3-1-2-4-6-8/h5-6H,1-4H2
charge 0 multiplicity 1
18 atoms
O  -3.582727 -0.774984 -0.008252
O  3.586707 0.775977 0.003999
C  -0.723177 -0.26324 -0.001727
C  0.72702 0.263896 0.010049
C  -1.757861 0.876452 0.005912
C  1.761859 -0.875586 -0.000901
C  -3.206055 0.421643 0.003735
C  3.210039 -0.420698 0.001373
H  -0.893057 -0.898929 -0.892375
H  -0.90094 -0.918091 0.873355
H  0.89736 0.89791 0.90183
H  0.904163 0.920514 -0.86383
H  -1.621471 1.547888 -0.870628
H  -1.619758 1.538767 0.888816
H  1.624052 -1.533603 -0.88734
H  1.625355 -1.551466 0.871936
H  -3.958346 1.254097 0.013813
H  3.962437 -1.253148 -0.000165
