program: Gaussian 09
title: 000070622
version: EM64L-G09RevD.01
frameworkgroup: C1[X(C5H5BrN2)]
method: RPBEPBE
basis: SDD
operation: Freq
keyword: #p
keyword: freq=noraman
keyword: PBEPBE/SDD
title: #p freq=noraman PBEPBE/SDD
converged: NO YES NO NO
title: Mulliken charges:
elementType: Br N N C C C C C H H H H H
charge: -0.004759 -0.063600 -0.634499 0.184120 -0.315196 -0.090586 -0.146374 -0.305812 0.227261 0.253219 0.252161 0.330628 0.313437
chargesum: 0.00000
title: Mulliken charges with hydrogens summed into heavy atoms:
elementType: Br N N C C C C C
charge: -0.004759 -0.063600 0.009566 0.184120 -0.087935 0.162633 -0.146374 -0.053652
polarizability: 1.42125749e+02 1.46000227e+00 7.33476272e+01 3.82012415e-03 -6.68772188e-03 3.11605047e+01
1716.lowfreq: -14.0642 -6.0529 -0.0002 -0.0001 0.0005 14.6137 97.4150 200.1212 276.7073
frequency: 97.4114 200.1192 276.7073 282.0488 366.7558 385.9759 414.4656 470.6186 532.0514 604.0491 622.5527 739.5286 814.8066 831.1859 912.1127 952.2383 953.4948 1008.0555 1075.2269 1142.9513 1304.7116 1323.4756 1333.1674 1379.2638 1464.1124 1546.1568 1585.0107 1621.9484 3140.3564 3148.3239 3171.2537 3557.7699 3712.2869
redmass: 5.3473 5.7442 12.6648 5.4000 1.2366 2.7990 3.2791 1.3699 1.7492 7.6333 7.5127 3.9499 1.6540 5.1542 1.3859 1.3398 5.3742 1.6128 2.6278 1.1883 1.2703 3.1575 5.2601 3.0180 2.9349 6.2426 2.7179 1.6625 1.0899 1.0929 1.0971 1.0450 1.1046
irintensity: 2.5434 0.7021 3.9511 1.1824 177.7607 8.8030 14.9495 143.2423 15.9694 19.1405 5.1000 1.0890 57.7401 3.5205 5.6703 0.0033 22.7179 0.7263 31.8005 14.6844 11.5249 2.7285 8.0442 39.7073 203.1565 20.7034 20.1445 399.7425 15.2131 7.8971 5.7813 99.3062 37.0107
temp: 298.150 k
press: 1.00000 atm
elementType: 35 7 7 6 6 6 6 6 1 1 1 1 1
symmnumber: 1
zpe: 245056.2 jmol-1
zpe.correction: 0.093337 hartree
zpe.thermalcorrener: 0.100600 hartree
zpe.thermalcorrenthalpy: 0.101544 hartree
zpe.thermalcorrgfe: 0.060643 hartree
zpe.sumelectzpe: -315.918772 hartree
zpe.sumelectthermal: -315.911509 hartree
zpe.sumelectthermalent: -315.910565 hartree
zpe.sumelectthermalfe: -315.951466 hartree
dipole: 3.3997 2.0509 -0.0028
dipole: 3.9704
quadrupole: -40.8535 -52.2711 -59.9511
quadrupole: 5.0635 -0.0119 -0.0070
quadrupole: 10.1717 -1.2458 -8.9259 5.0635 -0.0119 -0.0070
hfenergy: -316.0121086 hartree
pointgroup: C01 [X(C5H5Br1N2)]
dipole: -1.3206512 0.8331766 -0.041942 debye
dipolederiv: -0.7705296 0.0134279 -0.0194697 0.0031761 -0.0767618 0.0004981 -0.0192924 0.000707 -0.0354764 -0.9013741 -0.1822909 -0.0155238 0.2821738 -0.2980585 0.0082305 -0.0189016 -0.0041428 -0.2590036 -1.6906758 -0.0727316 -0.0245992 -0.0920636 -0.1062456 -0.0070556 -0.0277503 -0.0068051 -0.7505484 1.9823949 0.0338032 0.0474657 0.114348 0.0523664 0.00356 0.048109 0.0018544 0.1968083 -0.5055934 0.0867945 -0.0089923 -0.433584 -0.0151967 -0.0135053 -0.0042887 0.0003316 -0.190317 0.0802569 -0.0842896 0.0044165 -0.1093921 0.2123709 -0.0055081 0.0046222 -0.0048686 -0.0594422 1.0786726 -0.1029064 0.0329263 0.0962078 -0.3705852 0.0048596 0.0304921 -0.0001992 -0.1313307 0.1406364 0.1864468 0.0025835 0.0196671 0.3816923 -0.0034558 0.0042276 0.0002417 -0.0191531 -0.007213 0.0954642 -0.00587 0.0819701 -0.0600868 0.004666 -0.0057648 0.0051768 0.1778311 0.0722937 -0.0758784 -0.0013819 -0.0709247 -0.0035863 -0.0002555 -0.001116 -0.000571 0.152568 0.0300938 0.0770628 -0.0033927 0.0936255 -0.0163861 0.0039132 -0.0036577 0.003889 0.128026 0.2463452 0.0326578 -0.004065 0.0538684 0.1755467 0.0032207 -0.0042293 0.002788 0.3905511 0.2446923 -0.0075604 -0.0040975 -0.0390725 0.1249309 0.0008322 -0.00245 0.0015983 0.399487 unknown
polarizability: 141.9624181|-2.8082422|73.4283713|2.9507578|-0.4859635|31.2430915 unknown
InChI: InChI=1S/C5H5BrN2/c6-4-1-2-5(7)8-3-4/h1-3H,7H2
charge 0 multiplicity 1
13 atoms
Br 3.284837 -0.078509 0.067815
N  -0.791097 -1.187746 -0.028067
N  -2.828915 -0.050961 -0.094314
C  -1.448167 0.018271 -0.05654
C  -0.746989 1.264504 -0.051782
C  0.658229 1.248414 -0.01444
C  1.323507 0.001212 0.015423
C  0.569011 -1.189502 0.006885
H  -1.290867 2.214639 -0.076385
H  1.223741 2.184832 -0.008955
H  1.055283 -2.170216 0.03027
H  -3.259415 -0.972846 -0.098217
H  -3.409457 0.781406 -0.114693
