program: Gaussian 09
title: 000070630
version: EM64L-G09RevD.01
frameworkgroup: C1[X(C6H8N2O2)]
method: RPBEPBE
basis: SDD
operation: Freq
keyword: #pfreq=noraman
keyword: PBEPBE/SDD
title: #p freq=noraman PBEPBE/SDD
converged: YES YES NO NO
title: Mulliken charges:
elementType: O O N N C C C C C C H H H H H H H H
charge: -0.413319 -0.232061 -0.408557 -0.077149 -0.470489 0.365847 -0.464378 -0.442514 0.175363 -0.247212 0.242297 0.241949 0.263287 0.263631 0.306739 0.259491 0.256564 0.380511
chargesum: 0.00000
title: Mulliken charges with hydrogens summed into heavy atoms:
elementType: O O N N C C C C C C
charge: -0.032808 -0.232061 -0.101818 -0.077149 0.013758 0.365847 0.062540 -0.183023 0.175363 0.009352
polarizability: 1.08518880e+02 -8.72575962e-03 8.40744572e+01 1.35791487e-01 -2.90665795e-02 4.43959421e+01
1716.lowfreq: -25.0473 -4.6382 -0.0010 -0.0006 0.0006 4.3764 24.3796 36.4789 76.0951
frequency: 20.6041 33.7471 75.7679 97.7094 212.7061 235.6221 315.4606 476.6539 509.6507 564.9824 616.7976 641.4207 648.1292 659.9879 708.4482 771.8049 777.3557 820.1940 873.1545 894.8256 992.0341 1030.1837 1036.1450 1084.6259 1092.4195 1109.9261 1162.8476 1197.0545 1235.5129 1240.8415 1272.5098 1286.6749 1342.0584 1365.1243 1392.1193 1433.5975 1443.8590 1469.1595 1565.4888 1666.8473 2978.5385 3003.4748 3020.3067 3059.7963 3226.7535 3238.9936 3514.0567 3579.5099
redmass: 3.9233 3.8311 2.6742 5.4442 7.9603 3.3713 6.0377 3.9590 1.7660 5.1198 3.1522 1.3631 1.8106 1.6052 4.5968 1.3678 1.3683 1.4299 4.3566 5.6216 3.9324 1.9970 3.1157 2.3157 2.0351 2.3028 1.1795 1.8481 1.5042 1.4957 1.1054 2.1759 2.4162 3.2903 2.1958 2.8091 1.1300 1.1182 4.4397 8.1907 1.0598 1.0603 1.0998 1.1002 1.0973 1.1000 1.0640 1.0819
irintensity: 2.7235 4.7736 1.9020 7.1682 0.6364 0.7658 6.0349 18.0929 34.0261 35.1229 10.0477 75.0125 154.3454 15.5766 0.7668 36.7100 2.7069 46.5023 3.2992 11.4382 19.0717 1.4682 223.2835 75.9420 9.2126 9.8102 0.2594 10.1065 2.6435 2.8787 0.0685 21.1458 34.1725 27.2562 40.4714 17.4585 38.9758 8.3848 16.9246 209.1815 18.9843 10.4195 9.3230 13.2124 9.2570 1.1009 25.2826 31.8787
temp: 298.150 k
press: 1.00000 atm
elementType: 8 8 7 7 6 6 6 6 6 6 1 1 1 1 1 1 1 1
symmnumber: 1
zpe: 364834.0 jmol-1
zpe.correction: 0.138958 hartree
zpe.thermalcorrener: 0.148510 hartree
zpe.thermalcorrenthalpy: 0.149454 hartree
zpe.thermalcorrgfe: 0.101462 hartree
zpe.sumelectzpe: -492.641468 hartree
zpe.sumelectthermal: -492.631916 hartree
zpe.sumelectthermalent: -492.630972 hartree
zpe.sumelectthermalfe: -492.678963 hartree
dipole: 1.5394 2.3885 0.0000
dipole: 2.8416
quadrupole: -59.4420 -60.0775 -59.5243
quadrupole: -17.9169 0.0236 -0.0101
quadrupole: 0.2393 -0.3963 0.1570 -17.9169 0.0236 -0.0101
hfenergy: -492.7804256 hartree
pointgroup: C01 [X(C6H8N2O2)]
dipole: -0.6372787 0.9185169 0.0055373 debye
dipolederiv: -0.8371903 -0.5607353 0.0128694 -0.5293056 -0.8125972 0.0146177 0.012497 0.0152321 -0.4310383 -0.7348998 0.2117196 0.0081586 -0.0464086 -0.9394518 0.0060703 0.0100186 0.0003114 -0.3065652 -0.2250286 0.0370123 -0.0001349 0.0616461 -0.5395979 0.0016177 -0.001053 0.0031325 -0.2316147 -0.3460677 0.0544942 0.0011526 0.0580549 -0.4454037 0.0002582 0.0015203 0.0006756 -0.266921 0.0963664 -0.0723985 0.0035169 0.054638 0.0232675 0.0016814 -0.0004136 0.0047074 0.211596 0.1505672 0.1160942 -0.0040175 -0.0888945 0.3076995 -0.0014503 0.0022428 -0.0068243 -0.0648271 -0.3123892 0.0699023 0.0087929 0.2801057 -0.0533565 -0.0030493 0.0040702 0.0013975 0.1497256 0.027925 0.0309159 -0.0049463 0.1223486 0.0487239 -0.0043242 -0.0064501 -0.0028268 -0.2070271 1.4842357 0.1681755 -0.0290676 0.2908743 1.4648835 -0.0165427 -0.0298166 -0.0136531 0.1876393 0.0771027 -0.1763781 -0.0017173 -0.1626432 0.4026696 -0.0009141 -0.0024876 -0.0008177 -0.1113821 -0.0100946 0.037643 -0.0207377 0.0140597 0.0110782 0.0909503 -0.0578148 0.100806 -0.0346134 -0.003427 0.0333923 0.0173612 0.0112489 0.003671 -0.0931201 0.055533 -0.1034604 -0.029366 0.1004465 0.0170938 0.01225 -0.0419269 0.0318939 -0.0798314 0.0068783 -0.0839691 0.005388 0.0996432 0.0207456 -0.0173507 -0.0382609 0.0384955 0.0799373 -0.0083096 0.0815708 0.000069 0.202115 0.0521783 0.0021715 0.0402551 0.1503582 0.0005474 0.0023608 -0.0001671 0.3440614 0.055024 -0.0755839 0.0031331 -0.1163882 0.0143359 0.0036534 0.0032644 0.0029504 0.1883158 0.0020063 -0.0642498 0.0041049 -0.0591896 0.0529551 0.0021788 0.0039732 0.002169 0.2007067 0.1736652 0.0999785 0.0044609 0.1497861 0.2403753 -0.0022804 0.0039866 -0.0012344 0.3958533 unknown
polarizability: 108.4648868|0.8335558|84.1006371|-1.2747823|-0.3474719|44.4237558 unknown
InChI: InChI=1S/C6H8N2O2/c9-6(10)2-1-5-3-7-4-8-5/h3-4,8-9H,1-2H2
charge 0 multiplicity 1
18 atoms
O  -3.656575 -1.140696 0.040095
O  -3.212197 1.138416 0.013642
N  2.148206 1.136866 -0.106439
N  3.070171 -0.924901 -0.107155
C  -0.366507 0.69906 -0.060154
C  1.067112 0.238094 -0.07975
C  -1.34369 -0.490335 -0.014417
C  1.666541 -1.027953 -0.080968
C  -2.789759 -0.038885 0.013195
C  3.328134 0.395097 -0.121973
H  -0.593596 1.315127 -0.952482
H  -0.557851 1.352788 0.813475
H  -1.20536 -1.154852 -0.888231
H  -1.161554 -1.120632 0.876665
H  2.073342 2.153764 -0.111546
H  1.184544 -2.002817 -0.064115
H  4.316883 0.847178 -0.143124
H  -4.598745 -0.81872 0.059383
