program: Orca
programVersion: 5.0.4
elementType: C H
charge: 0
multiplicity: 2
keywords: SP CCSD(T) aug-cc-pVTZ aug-cc-pVTZ/C TightSCF
keywords: NoFrozenCore
formula: CH
InChI: InChI=1/CH/h1H
2 atoms
C  0.01949 -0.033887 0.07745
H  -0.232246 0.403795 -0.922902
totalener: -38.28212440 hartree
nucrepener: 2.83347642 hartree
electener: -41.11560082 hartree
oneelecener: -56.60055728 hartree
twoeener: 15.48495646 hartree
kineticenergy: 38.24462768 hartree
s2: 0.759676
energy: -308.2335 -23.9387 -12.8776 -11.5711 0.5194 0.7990 2.5743 2.6608 3.3117 3.9205 6.1850 7.2883 7.3855 8.2190 8.2241 10.0046 10.3717 10.4988 10.8847 15.3526 15.5349 16.5062 18.1810 23.7816 23.7817 23.9807 24.0895 25.8875 28.9124 28.9308 29.3613 29.4598 29.4930 29.5916 29.8154 35.1086 35.4298 35.6422 36.2180 36.2463 42.0102 47.5240 47.6983 55.0394 72.0934 72.5469 77.7311 84.2014 87.5911 87.6160 91.2825 91.2850 92.9879 92.9913 93.5598 93.5599 96.6724 99.3745 99.5913 103.1636 113.1718 113.1754 124.6792 124.8802 137.3304 137.6581 140.6285 148.1910 311.2470 electronvolt
energy: -307.6082 -21.3754 -11.8407 0.8310 0.8418 1.5863 2.6928 3.5502 4.0698 4.4360 6.3012 7.4038 7.7277 8.5266 8.5269 10.1452 10.5281 10.8187 11.1179 15.7889 16.8051 17.8531 18.4661 24.0993 24.1407 24.1413 24.5570 26.3143 29.6257 29.6489 29.9062 29.9397 30.0731 30.3783 30.5575 35.1994 35.4423 35.9811 36.5741 36.6422 42.4192 47.8242 48.6536 55.4410 72.8449 74.1868 77.9461 84.6015 87.8221 88.8853 92.0099 92.0248 94.4853 94.5768 94.6511 94.6541 97.3644 99.5169 100.6429 103.4299 113.4162 113.4376 124.6258 124.9542 137.3987 138.1513 140.8128 148.3386 311.6971 electronvolt
e0: -38.282124520 hartree
ecorr: -0.140530609 hartree
corrType: UHF
chargesum: -0.0000000
charge: -0.406852 0.406852
charge: 0.534938 -0.534938
qa: -0.4069 0.4069
va: 2.0516 0.7103
energy: -38.426347021260 hartree
dipole: -0.21789 0.09287 -0.12502 0.37883 -0.16146 0.21737 -0.86584 0.36903 -0.49681
magnitude: 0.55651 au
magnitude: 1.41453 debye
dipolemethod: MDCI
