program: Gaussian 09
title: 000070628
version: EM64L-G09RevD.01
frameworkgroup: C1[X(C9H11N)]
method: RPBEPBE
basis: SDD
operation: Freq
keyword: #pfreq=noraman
keyword: PBEPBE/SDD
title: #p freq=noraman PBEPBE/SDD
converged: YES YES NO NO
title: Mulliken charges:
elementType: N C C C C C C C C C H H H H H H H H H H H
charge: -0.114432 -0.408394 -0.415288 -0.525796 0.443015 -0.427490 -0.376989 -0.219872 -0.222105 -0.243980 0.238852 0.209889 0.221707 0.240847 0.180616 0.246338 0.227029 0.272843 0.223341 0.223712 0.226157
chargesum: 0.00000
title: Mulliken charges with hydrogens summed into heavy atoms:
elementType: N C C C C C C C C C
charge: -0.114432 0.040346 0.047267 -0.098842 0.443015 -0.200461 -0.104146 0.003469 0.001606 -0.017823
polarizability: 1.29685571e+02 -2.10822492e+00 9.87188305e+01 9.69732219e+00 1.90849586e+00 6.27627796e+01
1716.lowfreq: -5.5121 -0.0005 -0.0005 0.0002 9.9458 15.2672 33.3599 67.3308 134.6566
frequency: 32.9455 67.2052 134.6333 208.9887 312.6983 337.8886 384.0927 404.5163 464.9689 589.6861 616.6903 703.6869 715.6607 745.0539 797.1497 801.6094 833.9664 857.2755 911.2623 968.8498 979.5218 984.2326 989.3901 995.9894 1020.1809 1027.3164 1066.4601 1076.2058 1078.7444 1121.1811 1138.6269 1170.0128 1182.8135 1210.0450 1224.0739 1264.3498 1306.2882 1344.9460 1386.6170 1439.1357 1454.0590 1460.8809 1477.1049 1484.3257 1594.0299 1616.2100 2871.2795 2992.7507 3052.2273 3064.4859 3109.1550 3123.2225 3136.4303 3152.4983 3163.6337 3164.2718 3182.5890
redmass: 3.1065 3.5283 3.0994 3.5044 3.3847 2.3713 3.2197 2.8556 2.8399 4.9903 6.3300 2.4286 2.2672 1.5089 1.7525 3.0356 3.4542 1.2501 1.3309 1.3489 1.3539 1.6776 5.9890 1.3330 1.8419 2.1202 1.2622 1.3646 1.4676 1.7642 1.4124 1.0564 1.1102 2.5399 1.1840 3.5886 1.4240 1.4546 5.5744 2.1269 1.0962 1.0987 1.2326 2.0890 6.1818 6.1247 1.0694 1.0883 1.0520 1.0611 1.0872 1.0864 1.0925 1.0956 1.1002 1.1140 1.1152
irintensity: 0.9070 2.1481 2.9127 1.9959 1.1601 1.2681 3.0077 0.2029 12.8154 3.9925 0.3585 29.5127 15.7898 72.4470 4.2123 2.7283 4.2159 0.1169 2.0642 7.1504 0.0556 26.6490 0.0734 3.9245 6.8379 9.6669 5.0098 13.5570 12.9936 2.5295 1.1607 0.3028 1.2288 0.2525 0.8193 30.3430 10.0843 10.6085 4.0742 11.7432 11.5853 1.9687 9.0813 13.0033 1.2392 7.0054 68.1089 22.8114 38.7192 29.6863 10.3218 0.8477 31.3914 26.7872 17.6285 3.9978 38.1021
temp: 298.150 k
press: 1.00000 atm
elementType: 7 6 6 6 6 6 6 6 6 6 1 1 1 1 1 1 1 1 1 1 1
symmnumber: 1
zpe: 460527.1 jmol-1
zpe.correction: 0.175405 hartree
zpe.thermalcorrener: 0.184293 hartree
zpe.thermalcorrenthalpy: 0.185238 hartree
zpe.thermalcorrgfe: 0.140454 hartree
zpe.sumelectzpe: -403.512372 hartree
zpe.sumelectthermal: -403.503484 hartree
zpe.sumelectthermalent: -403.502540 hartree
zpe.sumelectthermalfe: -403.547324 hartree
dipole: -0.7591 1.2277 0.7353
dipole: 1.6199
quadrupole: -53.1547 -55.1006 -62.7455
quadrupole: -2.2858 0.4107 -0.3353
quadrupole: 3.8456 1.8996 -5.7452 -2.2858 0.4107 -0.3353
hfenergy: -403.6877779 hartree
pointgroup: C01 [X(C9H11N1)]
dipole: -0.3610525 0.5010361 -0.1574077 debye
dipolederiv: -0.6916034 0.0759438 0.2436272 0.1942366 -0.3148788 0.0444938 0.3011255 0.061626 -0.2429087 0.1210316 0.0192037 -0.0539665 -0.0214487 0.2049667 -0.093845 -0.1007836 -0.0960341 0.0417921 0.1116342 -0.0370499 -0.056286 -0.0758234 0.1090204 -0.0911319 -0.0768852 -0.1080682 0.1145629 0.4523274 -0.0004975 -0.1410718 -0.0083165 0.2843385 -0.0898219 -0.288928 -0.0350727 0.2779092 0.1982916 0.0401106 0.0836211 0.0553434 -0.0343074 0.0378303 0.2129153 0.0107704 -0.0257378 -0.1659712 -0.0166308 0.0467545 -0.0297493 -0.0421079 -0.123761 0.0365881 -0.1172014 -0.0525163 -0.1353636 0.0663492 -0.0344856 0.0702665 -0.0319835 -0.0538056 -0.1002618 -0.0672988 -0.1140546 -0.0039525 0.0821084 0.0035109 0.0860715 0.0198617 -0.086765 -0.0225225 -0.096371 -0.0866527 -0.0111403 -0.0197466 0.0711481 -0.0293597 0.0001764 -0.1283544 0.0819032 -0.1336281 -0.024695 0.0426225 0.0307987 0.0689405 0.0134214 -0.1149647 -0.0389016 0.0699806 -0.0337245 -0.1193233 -0.0877767 -0.0940996 -0.0089292 -0.1341644 -0.0105654 0.0318953 -0.0056613 0.0393243 0.0838205 -0.012072 -0.0146089 -0.0333132 0.0881941 0.0056616 0.1219785 -0.092801 0.1123917 -0.0316049 0.1070721 -0.054606 0.0251317 -0.0206496 -0.1388588 -0.0422941 0.0096483 0.038803 0.0319057 0.1075222 -0.0059667 -0.0050743 -0.0077877 0.0481901 0.0409676 0.0555168 0.0150044 -0.1261615 -0.0747279 0.060628 -0.00614 0.0198208 -0.1788385 0.16144 0.0481674 0.0675031 -0.003504 -0.0486722 -0.0182181 -0.0266642 -0.059684 0.0212339 -0.1080282 0.0301547 -0.0793955 -0.09432 0.0538729 0.0623978 -0.0849595 0.0473033 0.0193331 0.1140162 -0.0643301 0.1161342 0.033196 0.1180774 -0.0826856 0.0242996 -0.0915236 0.0402964 0.0608808 0.0380494 0.060544 0.0982084 -0.0014263 -0.1045662 0.0291691 -0.1182207 -0.0130815 0.0894639 0.0315783 0.0896787 0.1010615 0.0425555 0.0400774 -0.0655117 0.0537496 0.0139761 0.1257724 -0.0787452 0.1266227 0.0297642 -0.1223012 -0.0289416 -0.0798008 -0.0316797 0.1125315 0.0279699 -0.0847088 0.0283917 0.1092584 unknown
polarizability: 127.9327352|10.9979226|82.9968489|9.5980779|-17.1418051|80.2375972 unknown
InChI: InChI=1S/C9H11N/c1-2-4-9(5-3-1)8-10-6-7-10/h1-5H,6-8H2
charge 0 multiplicity 1
21 atoms
N  -2.087179 -0.740914 -0.008708
C  -3.556442 -0.430981 -0.129522
C  -2.729287 0.189202 0.989551
C  -1.204838 -0.095127 -1.021434
C  0.229231 0.034341 -0.519415
C  1.061652 1.074209 -1.003421
C  0.76275 -0.895759 0.408099
C  2.406442 1.178724 -0.58017
C  2.10506 -0.789696 0.835974
C  2.933491 0.245259 0.341937
H  -4.234491 -1.263418 0.081877
H  -3.882446 0.238344 -0.938957
H  -2.502202 1.26182 0.914736
H  -2.804807 -0.197286 2.010298
H  -1.576005 0.911289 -1.337978
H  -1.231842 -0.744344 -1.919887
H  0.65768 1.807092 -1.714087
H  0.10928 -1.687637 0.788396
H  3.037949 1.98842 -0.963663
H  2.505303 -1.513988 1.555006
H  3.9747 0.32615 0.674268
