program: Gaussian 09
title: 000070629
version: EM64L-G09RevD.01
frameworkgroup: C1[X(C7H16N2O)]
method: RPBEPBE
basis: SDD
operation: Freq
keyword: #p
keyword: freq=noraman
keyword: PBEPBE/SDD
title: #p freq=noraman PBEPBE/SDD
converged: YES YES NO NO
title: Mulliken charges:
elementType: O N N C C C C C C C H H H H H H H H H H H H H H H H
charge: -0.445460 -0.192739 -0.293091 -0.040486 -0.314201 -0.321935 -0.426654 -0.425345 -0.318482 -0.743910 0.194803 0.204343 0.213808 0.224209 0.198800 0.191220 0.212255 0.210559 0.187876 0.270678 0.201600 0.177259 0.228246 0.237547 0.220351 0.348748
chargesum: 0.00000
title: Mulliken charges with hydrogens summed into heavy atoms:
elementType: O N N C C C C C C C
charge: -0.096712 -0.192739 -0.022413 0.154317 0.103950 0.101074 -0.023179 -0.026911 0.060377 -0.057766
polarizability: 1.05497027e+02 -2.60304669e-01 9.02233168e+01 2.09213358e+00 2.37224116e+00 7.93989795e+01
1716.lowfreq: -27.8403 -10.8192 -0.0009 -0.0006 0.0003 10.1068 52.9220 73.4951 119.7617
frequency: 52.5970 73.2390 119.7136 204.7044 225.9027 258.9943 274.7635 322.5546 340.4221 404.9515 424.9408 444.6581 457.7051 522.8503 631.2679 682.3779 706.5305 741.0794 836.2871 846.4845 880.7409 919.6411 930.9163 948.2417 975.6021 1042.7635 1051.1961 1063.8646 1080.8314 1095.6169 1103.0354 1132.4962 1152.1070 1170.0952 1187.3554 1203.5169 1244.3860 1251.3902 1274.4421 1301.2722 1317.4515 1319.6709 1334.1175 1343.6383 1371.4562 1387.3848 1388.9989 1410.5109 1444.7568 1452.8685 1458.0140 1463.0913 1469.2407 1479.0222 1482.2452 1496.1990 2864.5666 2871.1360 2891.2844 2900.0745 2908.9937 2939.9043 2987.4906 3037.7882 3040.7190 3045.7168 3054.2034 3069.8003 3082.9485 3090.6003 3219.8105 3465.9186
redmass: 3.4794 4.6618 2.8119 2.3398 2.9508 1.8570 1.3900 2.3284 2.1589 2.1975 2.5502 2.4830 2.9347 1.5981 2.7985 1.7461 1.0965 2.5109 3.1357 1.4870 2.6864 2.0789 1.7020 2.1018 2.8527 1.9254 1.7188 1.8808 1.8620 2.7524 2.1372 1.6290 2.2668 2.3328 1.2284 1.2699 1.5277 1.2925 1.3258 1.2010 1.3993 1.2579 1.2704 1.4339 1.3958 1.4155 1.2820 1.2076 1.3448 1.0807 1.0754 1.0921 1.1056 1.0540 1.0565 1.0799 1.0713 1.0697 1.0809 1.0701 1.0684 1.0717 1.0360 1.0891 1.0913 1.0932 1.0905 1.0918 1.0975 1.1003 1.0634 1.0754
irintensity: 2.6363 4.8441 5.0928 0.7412 1.8486 0.6625 1.0284 11.3060 0.6534 0.9235 2.9288 10.4124 0.8567 81.1880 5.3393 68.8262 93.2895 15.6834 3.4127 0.1762 2.6852 1.5118 7.8472 36.1443 38.9857 17.8008 0.4592 2.1362 14.5530 24.0113 2.2840 24.6379 41.0522 14.2595 12.9288 7.1031 15.6969 19.0142 20.3201 8.9449 8.6637 37.6942 4.6734 5.1958 7.2809 2.9136 29.1958 60.7039 3.5819 1.4581 1.8698 33.3965 0.9877 6.9482 8.9645 7.2992 70.1563 99.7335 14.8437 45.4602 160.7478 130.7263 19.3307 50.7519 55.6389 40.2850 34.3754 30.9358 41.9572 22.4510 150.0740 0.9303
temp: 298.150 k
press: 1.00000 atm
elementType: 8 7 7 6 6 6 6 6 6 6 1 1 1 1 1 1 1 1 1 1 1 1 1 1 1 1
symmnumber: 1
zpe: 608128.6 jmol-1
zpe.correction: 0.231624 hartree
zpe.thermalcorrener: 0.242137 hartree
zpe.thermalcorrenthalpy: 0.243081 hartree
zpe.thermalcorrgfe: 0.195785 hartree
zpe.sumelectzpe: -460.193035 hartree
zpe.sumelectthermal: -460.182522 hartree
zpe.sumelectthermalent: -460.181578 hartree
zpe.sumelectthermalfe: -460.228874 hartree
dipole: 2.0653 1.2172 -1.6348
dipole: 2.9016
quadrupole: -62.3010 -61.9831 -66.4062
quadrupole: -5.2012 9.9735 4.6095
quadrupole: 1.2624 1.5803 -2.8428 -5.2012 9.9735 4.6095
hfenergy: -460.4246594 hartree
pointgroup: C01 [X(C7H16N2O1)]
dipole: -0.8529676 0.4106578 0.6380042 debye
dipolederiv: -0.5413505 0.052532 0.031578 0.0680825 -0.5905005 -0.1112242 -0.0408576 -0.0359469 -0.6709049 -0.768079 0.0310051 0.0085454 0.0427882 -0.5406273 -0.0306677 0.094365 -0.0024719 -0.5010921 -0.4493769 0.0612222 0.1493297 0.0879098 -0.5291869 0.0153172 0.2321804 0.022745 -0.5299867 0.5417036 0.1051548 0.1162613 0.0580431 0.0941052 0.0254432 0.0339285 0.0286335 0.3208335 0.1522704 0.107614 -0.160512 0.1677067 0.2914466 -0.0497738 -0.1883524 -0.0587773 0.3575319 0.2180942 -0.2319446 -0.0317437 -0.2798233 0.3478348 0.0388356 -0.0425234 0.0206928 0.2610853 0.2577664 -0.2540726 -0.0422352 -0.1831062 0.3784435 0.0353662 -0.0202024 0.0187807 0.3226994 0.210191 0.1463974 -0.1734475 0.1083375 0.3685116 -0.0743304 -0.1183603 -0.0451195 0.3959505 0.2405777 0.0293541 0.072064 0.0453291 0.31754 -0.0380915 0.1266298 -0.1032851 0.4614227 -0.058279 -0.0706979 0.0203212 -0.0823494 -0.0791743 0.0374827 -0.0205324 -0.008692 0.0362841 -0.036131 -0.0147867 0.0376768 -0.0107666 0.0110118 0.0188117 -0.0703575 0.0041751 -0.2592229 0.0007043 -0.0507371 0.0549307 -0.0321108 0.003421 -0.1164409 0.0868673 0.0120091 -0.2146179 0.0056624 0.128398 -0.0340213 0.0974983 -0.0734756 0.0294261 0.0044575 0.0163845 0.0590226 0.0384178 -0.0829276 0.0536283 -0.0467155 -0.0753368 0.0648352 0.0701941 0.0857363 0.0222717 -0.0232209 0.0924805 0.0115256 0.0901673 -0.0413889 -0.045496 0.0639473 -0.1672309 -0.1748103 -0.0160034 0.1291281 0.0584513 0.0675762 -0.0601137 -0.0475738 0.0519444 -0.1823107 -0.184586 -0.0241789 -0.0992945 0.0479488 -0.0686289 -0.0927191 0.0860421 0.0685398 0.1138726 0.0232902 -0.0584126 0.1191336 -0.0292469 0.1113698 -0.1128012 0.0475418 0.0106553 0.0226082 0.0735581 0.0034042 -0.0604555 0.1303635 -0.0247302 -0.011775 -0.092659 0.0662714 0.0347442 -0.2590556 0.0550318 -0.0415286 -0.1036563 -0.0925167 0.0978275 0.0379851 -0.2444078 0.0267839 0.2196877 -0.1818594 -0.0385369 -0.0684589 -0.0978388 0.0700171 -0.0165312 -0.0128178 -0.0021978 0.0348213 0.0662861 -0.065658 0.0417969 -0.016802 -0.194379 0.1250035 -0.0018326 0.1092439 -0.1139753 0.0339612 0.1301829 0.0602511 0.0955388 -0.0829575 -0.048482 0.063464 -0.0434188 0.0578687 0.1101826 0.0020357 -0.0145461 -0.0040437 0.0877698 -0.0046102 0.0267749 0.065563 -0.1088942 -0.1450096 -0.0498489 -0.0886935 0.0012204 0.0837743 0.0094829 -0.0968493 -0.0119884 0.05805 0.3676473 -0.0741494 -0.148111 -0.1021357 0.3327327 0.1043073 -0.1431263 0.0794664 0.3127681 unknown
polarizability: 105.3111601|1.1925417|90.4218321|2.7507854|-1.9360347|79.3863306 unknown
InChI: InChI=1S/C7H16N2O/c1-7(6-10)9-4-2-8-3-5-9/h7-8,10H,2-6H2,1H3
charge 0 multiplicity 1
26 atoms
O  2.076708 -0.964333 -1.350797
N  0.078864 0.088703 0.083318
N  -2.78213 -0.206101 -0.064283
C  1.454068 0.323167 0.653743
C  -0.630303 -1.018693 0.793339
C  -0.812019 1.275677 -0.040655
C  -1.922131 -1.401673 0.050909
C  -2.102487 0.887637 -0.787488
C  2.356935 -0.81422 0.073684
C  2.041331 1.698357 0.282374
H  1.43366 0.239782 1.767059
H  -0.888022 -0.714388 1.835368
H  0.036127 -1.897505 0.842858
H  -0.293624 2.061311 -0.613757
H  -1.086969 1.686869 0.959966
H  -1.63856 -1.831412 -0.942398
H  -2.456055 -2.182116 0.623503
H  -2.772455 1.765972 -0.832117
H  -1.822907 0.607973 -1.834226
H  -3.716156 -0.415432 -0.436734
H  3.423559 -0.549607 0.184171
H  2.181593 -1.770331 0.613671
H  1.440483 2.537991 0.672328
H  2.139627 1.800604 -0.813647
H  3.051925 1.786169 0.72032
H  1.10174 -0.701304 -1.40461
