program: Orca
programVersion: 5.0.4
elementType: C H
charge: 0
multiplicity: 2
keywords: Opt RIJCOSX PBEh-3c
formula: CH
InChI: InChI=1/CH/h1H
2 atoms
C  0.086757 0.0000 0.0000
H  -1.033796 0.0000 0.0000
totalener: -38.38291270 hartree
nucrepener: 2.83348254 hartree
electener: -41.21639523 hartree
oneelecener: -56.64161451 hartree
twoeener: 15.42521928 hartree
kineticenergy: 38.16818489 hartree
exchangeener: -3.001876289504 hartree
correlationener: -0.260064094187 hartree
xcener: -3.261940383691 hartree
s2: 0.752647
dispersion: -0.000138920 hartree
energy: -286.8840 -19.7057 -10.0406 -8.3524 -2.7278 4.7867 13.7405 14.3180 14.7752 18.9866 26.6430 46.3756 46.5375 46.7145 46.7279 58.4449 360.8682 electronvolt
energy: -286.4378 -18.2232 -9.3183 -2.1419 -0.7514 5.1261 14.6619 15.1812 16.2683 19.7426 27.0738 46.9979 48.2809 48.6390 48.6833 59.1946 361.4933 electronvolt
chargesum: -0.0000000
charge: -0.160508 0.160508
charge: -0.087936 0.087936
qa: -0.1605 0.1605
va: 1.9132 0.9097
energy: -38.382713770568 hartree
dipole: -0.96988 0.35337 -0.61651 0.00000 0.00000 0.00000 0.00000 -0.00000 -0.00000
magnitude: 0.61651 au
magnitude: 1.56703 debye
