program: Orca
programVersion: 5.0.4
elementType: C H
charge: 0
multiplicity: 2
keywords: Freq RIJCOSX PBEh-3c
frequency: 0.00 0.00 0.00 0.00 0.00 2933.84
frequency: 2933.84
formula: CH
InChI: InChI=1/CH/h1H
2 atoms
C  -4.702892 2.493464 -0.136589
H  -4.954628 2.931146 -1.136941
totalener: -38.38291170 hartree
nucrepener: 2.83347641 hartree
electener: -41.21638811 hartree
oneelecener: -56.64186986 hartree
twoeener: 15.42548175 hartree
kineticenergy: 38.16847153 hartree
exchangeener: -3.001903537670 hartree
correlationener: -0.260065178172 hartree
xcener: -3.261968715842 hartree
s2: 0.752649
energy: -286.8877 -19.7064 -10.0415 -8.3539 -2.7288 4.7863 13.7379 14.3181 14.7732 18.9851 26.6415 46.3741 46.5354 46.7117 46.7266 58.4437 360.8655 electronvolt
energy: -286.4410 -18.2233 -9.3191 -2.1429 -0.7519 5.1266 14.6606 15.1797 16.2672 19.7422 27.0745 46.9954 48.2787 48.6380 48.6823 59.1935 361.4910 electronvolt
chargesum: 0.0000000
charge: -0.160469 0.160469
charge: -0.087934 0.087934
qa: -0.1605 0.1605
va: 1.9133 0.9097
dispersion: -0.000138920 hartree
energy: -38.382712652167 hartree
dipole: -0.21789 0.07935 -0.13853 0.37883 -0.13803 0.24080 -0.86584 0.31540 -0.55045
magnitude: 0.61658 au
magnitude: 1.56721 debye
temp: 298.15 k
press: 1.00 atm
zeropoint: 0.00668379 hartree
thermalvibcorrection: 0.00000001 hartree
thermalrotcorrection: 0.00094418 hartree
thermaltrasncorrection: 0.00141627 hartree
thermaltotal: -38.37366841 hartree
thermalcorr: 0.00236046 hartree
nonthermalcorr: 0.00668379 hartree
totalcorr: 0.00904425 hartree
thermalcorrenthalpy: 0.00094421 hartree
totalenthalpy: -38.37272420 hartree
vibrat: 0.00000001 hartree
rotat: 0.00345951 hartree
transl: 0.01598380 hartree
total: 0.02009778 hartree
totalentropycorr: -0.02009778 hartree
gibbsenthalpy: -38.39282198 hartree
gibbsminuselec: -0.01010932 hartree
