program: Orca
programVersion: 5.0.4
elementType: C H
charge: 0
multiplicity: 2
keywords: SP r2SCAN-3C def2-QZVP def2-TZVP/C def2/J TightSCF
keywords: NoFrozenCore
formula: CH
InChI: InChI=1/CH/h1H
2 atoms
C  0.01949 -0.033887 0.07745
H  -0.232246 0.403795 -0.922902
totalener: -38.46439712 hartree
nucrepener: 2.83347640 hartree
electener: -41.29787352 hartree
oneelecener: -56.65327653 hartree
twoeener: 15.35540301 hartree
kineticenergy: 38.32459781 hartree
exchangeener: -5.417972265745 hartree
correlationener: -0.179356412824 hartree
xcener: -5.597328678570 hartree
s2: 0.754427
energy: -276.0664 -16.8369 -7.9859 -6.3865 -4.8473 1.4636 4.6383 4.6551 4.7421 5.7507 9.9432 11.4263 11.7536 12.7533 13.1286 18.7446 20.5980 20.6463 21.0835 22.0947 22.1065 26.0905 31.6524 44.2152 44.3527 46.1271 46.2402 46.3079 46.4833 49.6279 49.9114 50.3427 53.2989 54.7195 54.8253 63.4292 65.8447 65.9129 68.2934 68.3540 73.4236 73.6943 74.0956 88.1904 93.9871 94.2011 102.5014 130.5151 130.5384 132.7231 132.7314 137.1392 137.3603 147.3790 148.4824 149.0193 157.9968 158.5166 161.0910 161.2722 161.8158 161.9363 162.5566 163.1759 163.1881 171.4351 171.4563 174.1557 180.4870 181.3732 190.8061 204.4583 204.6572 207.6761 207.7750 210.2484 222.0301 224.4213 224.4534 238.0281 238.1440 262.4134 269.4559 269.5926 327.1637 752.4815 4005.8560 electronvolt
energy: -275.6304 -15.5756 -7.4069 -4.4022 -2.9018 2.0100 5.2633 5.6595 5.9773 6.5676 11.6031 11.6973 12.0608 14.3288 14.3304 19.0936 21.6137 21.6670 22.0870 22.8538 23.3206 26.2868 32.4987 44.7358 44.7816 46.3557 46.9975 48.2130 48.2309 51.2990 51.8200 51.9333 53.6846 54.6292 55.3614 64.6436 65.8719 65.9941 67.4304 67.6739 73.7109 74.7762 75.4558 87.6547 93.6076 94.1071 102.2350 131.7455 131.7485 136.0881 136.1984 137.2431 137.3868 147.2439 149.0540 149.6478 157.7990 158.4938 162.3734 162.7134 163.1073 164.8783 164.9303 165.2478 165.6947 169.4630 169.4656 173.1098 180.5874 181.1550 192.3416 202.6574 202.7500 205.9938 206.1236 208.6241 220.5531 221.8448 221.8536 235.6751 235.7291 260.5856 267.3709 267.5076 325.2908 751.8148 4005.5450 electronvolt
chargesum: -0.0000000
charge: -0.014722 0.014722
charge: 0.247661 -0.247661
qa: -0.0147 0.0147
va: 1.9018 0.9277
dispersion: -0.000053272 hartree
energy: -38.464317560064 hartree
dipole: -0.21789 0.08719 -0.13069 0.37883 -0.15165 0.22718 -0.86584 0.34629 -0.51955
magnitude: 0.58191 au
magnitude: 1.47910 debye
