program: Gaussian 09
title: 000070612
version: EM64L-G09RevD.01
frameworkgroup: C1[X(C7H12O)]
method: RPBEPBE
basis: SDD
operation: Freq
keyword: #pfreq=noraman
keyword: PBEPBE/SDD
title: #p freq=noraman PBEPBE/SDD
converged: YES YES NO NO
title: Mulliken charges:
elementType: O C C C C C C C H H H H H H H H H H H H
charge: -0.199645 -0.367965 -0.340982 -0.512196 -0.694535 0.504450 -0.217138 -0.694597 0.197286 0.230183 0.191940 0.202165 0.204150 0.224205 0.215521 0.216420 0.208930 0.165649 0.241399 0.224759
chargesum: 0.00000
title: Mulliken charges with hydrogens summed into heavy atoms:
elementType: O C C C C C C C
charge: -0.199645 0.059504 0.053123 -0.083841 -0.053664 0.504450 -0.051489 -0.228438
polarizability: 8.96064934e+01 -9.61824450e+00 8.87979974e+01 -6.96235293e+00 3.97806677e+00 5.79153306e+01
1716.lowfreq: -18.8764 -10.2821 -0.0002 0.0003 0.0004 4.4652 43.4726 64.8022 111.5003
frequency: 43.1595 64.7239 111.4122 123.7143 175.5029 221.8332 238.3869 305.8371 346.8344 417.9493 535.7667 603.5278 687.0554 730.8713 792.3444 843.3089 899.6528 924.7470 959.1374 972.6836 993.0314 1018.8905 1069.7271 1093.6402 1106.9967 1208.2586 1254.0308 1272.0922 1288.3159 1313.5898 1330.1470 1346.2622 1363.4865 1391.5525 1433.9319 1459.4266 1466.1703 1476.0705 1478.1855 1486.7131 1602.3908 1638.8848 2866.0807 2965.2521 2973.6512 2976.5405 2987.5259 3009.9963 3034.4510 3059.1236 3071.0684 3073.6824 3086.1275 3194.0484
redmass: 2.7503 2.0674 2.2486 3.1576 2.8165 1.8867 1.4883 2.9399 2.7401 2.5192 2.7225 4.1223 1.1019 1.0841 1.2112 3.9081 1.7387 1.2397 1.6643 1.5232 1.5759 3.3605 2.5873 1.4382 2.1534 1.4953 1.2908 1.2901 1.0722 1.4324 2.4712 1.5394 1.2126 1.2129 1.1698 1.1362 1.0692 1.0720 1.0434 1.0781 7.6847 4.6755 1.0855 1.0583 1.0380 1.0597 1.0597 1.0974 1.1014 1.1040 1.1003 1.1003 1.0622 1.1138
irintensity: 2.6909 0.9698 0.7702 0.4108 6.3349 3.0528 1.3530 6.6989 0.5615 4.6429 10.8801 3.0680 1.8001 10.4047 0.3932 15.5641 10.5490 2.8685 14.0928 17.8022 49.5149 0.7762 1.0791 6.4856 14.1185 3.0173 3.9412 3.4663 2.6718 2.2732 20.0991 0.1952 7.1883 12.2613 6.6229 1.7343 0.3565 5.1430 12.4521 17.0318 157.3785 20.9126 123.4987 24.8503 26.5389 20.3022 57.7587 9.3690 1.0526 11.7525 73.6917 72.8037 6.8606 13.7628
temp: 298.150 k
press: 1.00000 atm
elementType: 8 6 6 6 6 6 6 6 1 1 1 1 1 1 1 1 1 1 1 1
symmnumber: 1
zpe: 450919.1 jmol-1
zpe.correction: 0.171746 hartree
zpe.thermalcorrener: 0.181536 hartree
zpe.thermalcorrenthalpy: 0.182481 hartree
zpe.thermalcorrgfe: 0.136041 hartree
zpe.sumelectzpe: -348.495640 hartree
zpe.sumelectthermal: -348.485849 hartree
zpe.sumelectthermalent: -348.484905 hartree
zpe.sumelectthermalfe: -348.531345 hartree
dipole: 0.2395 -3.0918 -0.4698
dipole: 3.1365
quadrupole: -45.9220 -54.2597 -50.2359
quadrupole: -4.8284 -2.7765 -0.4796
quadrupole: 4.2172 -4.1205 -0.0967 -4.8284 -2.7765 -0.4796
hfenergy: -348.6673859 hartree
pointgroup: C01 [X(C7H12O1)]
dipole: 0.0204519 1.2336088 0.0226354 debye
dipolederiv: -0.4712844 -0.0993275 -0.0461346 -0.0141058 -0.975016 0.0025178 -0.0496302 -0.0341843 -0.3423531 0.0436769 -0.0140876 -0.0190074 0.0086302 0.1521291 0.0342549 -0.1488916 -0.002957 0.0432468 0.0522883 -0.0235304 0.0148195 -0.0306351 0.1774489 0.0003739 0.1023518 0.0240647 0.1028227 -0.2184569 -0.0937652 -0.0152289 -0.0821711 0.0802554 -0.0096913 0.0315022 0.0064767 0.1050675 -0.0722592 -0.0371627 0.0488247 -0.0302881 0.0839886 0.0189997 -0.0013042 0.006545 0.0394242 0.267914 0.2105732 0.0688136 0.1261593 -0.4991458 0.0751112 0.1884009 0.154021 -0.0062688 0.5702525 -0.1521653 0.2340137 0.0462629 1.2382186 -0.0108785 0.2222486 -0.1464949 0.2351636 -0.168399 0.031673 0.1561043 -0.1371039 0.0805178 -0.0788753 0.1183001 -0.0074384 -0.2616805 0.0184107 -0.0104131 0.0164807 0.0064125 -0.0526161 -0.1386655 0.0205942 -0.1031938 -0.0609277 0.0637193 0.0406996 -0.0236296 0.0233357 -0.0552995 0.1077826 -0.0346071 0.0719144 -0.0034839 0.017532 0.0053407 -0.0108624 0.0438775 -0.1123676 0.1499935 -0.0325398 0.1129478 -0.0250724 0.0297467 0.0289839 0.0438819 0.0023073 -0.0534734 -0.1429726 0.013963 -0.117689 -0.0717158 0.0227575 0.0260124 -0.0325433 0.0355168 -0.0855299 0.1291052 -0.0254331 0.0679064 0.0042571 0.0667463 0.0019406 -0.003715 0.0055761 -0.0000193 -0.1288286 -0.0031537 -0.0729406 -0.0169628 0.0775843 0.0706182 -0.0281863 0.0202151 -0.0946673 0.1253269 0.0146842 0.1104585 0.006253 -0.1945269 -0.0478576 -0.0811081 -0.043447 0.0931709 -0.0080894 -0.1059259 -0.0126256 0.0274286 0.0833244 -0.0070612 0.0150725 0.0356121 -0.0636066 -0.1454207 0.061681 -0.1130661 -0.0455977 -0.2172394 0.0077949 -0.1557745 -0.0900592 0.0196384 -0.043678 -0.1692724 0.0066847 0.0144404 0.0773237 0.0809281 -0.0591814 0.058562 -0.0239705 0.0421991 -0.0515324 0.0543279 0.129431 -0.0491107 -0.019194 -0.1226394 0.0153427 0.0903443 0.0214351 -0.1514356 -0.0047572 0.1265278 unknown
polarizability: 88.2471701|10.3961685|90.5466783|5.9348339|0.2311082|57.525973 unknown
InChI: InChI=1S/C7H12O/c1-3-4-5-7(2)6-8/h6H,2-5H2,1H3
charge 0 multiplicity 1
20 atoms
O  1.621599 -1.825713 0.182721
C  -1.127831 0.13696 0.240425
C  -2.488394 -0.033805 -0.471971
C  0.023024 0.44792 -0.758898
C  -3.639629 -0.339296 0.510139
C  1.369956 0.5834 -0.077274
C  2.062941 -0.659513 0.367285
C  2.002451 1.769504 0.168065
H  -1.197902 0.954608 0.986033
H  -0.884946 -0.78888 0.795826
H  -2.722025 0.886669 -1.045714
H  -2.407142 -0.853347 -1.214411
H  -0.214409 1.374907 -1.314955
H  0.073019 -0.38223 -1.490358
H  -3.440287 -1.269331 1.074737
H  -4.600788 -0.465818 -0.021231
H  -3.764666 0.478756 1.244635
H  3.041408 -0.490352 0.8874
H  1.573575 2.730497 -0.137431
H  2.971846 1.803363 0.683178
