program: Orca
programVersion: 5.0.4
elementType: C
charge: 0
multiplicity: 3
keywords: SP BP86 def2-TZVP def2-TZVP/C def2/J TightSCF
keywords: NoFrozenCore
formula: C
InChI: InChI=1/C
1 atoms
C  0.0000 0.0000 0.0000
totalener: -37.84921175 hartree
nucrepener: 0.00000000 hartree
electener: -37.84921175 hartree
oneelecener: -50.45733506 hartree
twoeener: 12.60812331 hartree
kineticenergy: 37.72891172 hartree
exchangeener: -5.059173069320 hartree
correlationener: -0.161991881538 hartree
xcener: -5.221164950859 hartree
s2: 2.003071
energy: -273.1621 -14.4892 -6.1628 -6.1627 -5.5873 3.2178 5.2749 5.2749 5.6905 16.3375 16.3375 16.3784 16.3784 16.7179 30.9432 34.7752 34.7752 35.4967 69.2504 69.2504 69.2807 69.2807 69.4564 69.4565 69.7207 75.8360 75.8360 76.1412 76.1414 76.8136 568.1523 electronvolt
energy: -272.4019 -11.9474 -4.6369 -3.1226 -3.1226 4.1439 6.1280 6.7255 6.7255 17.6379 17.9346 17.9346 18.7798 18.7798 32.9919 36.3057 37.5759 37.5759 71.0252 71.2490 71.2490 71.8498 71.8498 72.8106 72.8106 78.1726 78.6917 78.6917 80.0711 80.0712 569.2903 electronvolt
chargesum: -0.0000000
charge: -0.000000
energy: -37.849211746905 hartree
dipole: 0.00000 -0.00000 -0.00000 0.00000 0.00000 0.00000 0.00000 0.00000 0.00000
magnitude: 0.00000 au
magnitude: 0.00000 debye
