program: Orca
programVersion: 5.0.4
elementType: C H
charge: 0
multiplicity: 2
keywords: SP revPBE0 def2-QZVP def2-TZVP/C def2/J TightSCF
keywords: NoFrozenCore
formula: CH
InChI: InChI=1/CH/h1H
2 atoms
C  0.086756 0.0000 0.0000
H  -1.033795 0.0000 0.0000
totalener: -38.47955653 hartree
nucrepener: 2.83348254 hartree
electener: -41.31303907 hartree
oneelecener: -56.65173873 hartree
twoeener: 15.33869966 hartree
kineticenergy: 38.33070105 hartree
exchangeener: -4.073873186862 hartree
correlationener: -0.184804889583 hartree
xcener: -4.258678076446 hartree
s2: 0.754110
energy: -281.4369 -18.2554 -9.1040 -7.4400 -3.7628 1.1798 3.8366 4.0002 4.1733 5.8391 9.5750 11.6722 11.8787 12.9964 13.1402 18.1513 19.9428 20.2437 20.7260 21.1699 21.3522 25.1441 30.4957 43.3274 43.4422 45.4017 45.4685 45.6246 45.7828 49.1923 49.2470 49.4454 51.9016 53.0743 53.1575 61.8081 63.1430 63.2198 65.3425 65.3481 70.6105 72.6224 73.1370 85.4597 90.6033 90.7414 100.0215 126.9159 126.9671 129.4487 129.4890 133.2095 133.3390 144.1964 145.5520 145.6638 154.2885 154.3545 158.3981 158.6197 158.9052 159.0376 159.1655 160.2769 160.7054 164.0901 164.1014 168.7989 176.6329 176.9838 187.3614 196.3515 196.4400 200.9855 201.0143 203.0576 215.9251 216.5568 216.5663 229.1777 229.2397 255.2747 260.3825 260.3893 317.8817 749.3542 3989.1971 electronvolt
energy: -281.0339 -16.9326 -8.5345 -3.2756 -1.8426 1.3729 4.1053 4.3921 4.9740 6.2258 9.9519 11.9224 12.4723 14.0893 14.0910 18.5381 20.2251 20.8573 21.4007 21.6008 22.4876 25.4511 30.7808 44.0963 44.1003 45.8439 46.7415 46.8215 46.8805 49.9075 50.8769 50.9802 52.6266 53.2612 54.1420 62.3777 63.6086 63.7272 65.3129 65.6778 70.7594 73.3988 74.6350 85.6231 90.8664 91.7475 100.4151 127.9790 127.9808 131.2209 131.2257 134.0135 134.0341 144.6134 145.7245 146.8392 154.3457 155.4243 159.1138 159.6608 160.1985 161.0570 161.0857 162.5911 162.5979 164.3305 164.3311 169.2273 177.0662 178.2533 188.4926 196.8155 196.8156 200.8882 201.2446 203.2728 216.0340 216.5145 216.5293 229.0722 229.3510 255.3075 260.3557 261.0715 318.0870 750.1108 3989.3610 electronvolt
chargesum: -0.0000000
charge: -0.054335 0.054335
charge: 0.245388 -0.245388
qa: -0.0543 0.0543
va: 1.8789 0.9075
energy: -38.479556533372 hartree
dipole: -0.96988 0.38601 -0.58387 0.00000 -0.00000 -0.00000 0.00000 -0.00000 -0.00000
magnitude: 0.58387 au
magnitude: 1.48408 debye
