program: Orca
programVersion: 5.0.4
elementType: C H
charge: 0
multiplicity: 2
keywords: SP WB97X-D4 def2-QZVP def2-TZVP/C def2/J TightSCF
keywords: NoFrozenCore
formula: CH
InChI: InChI=1/CH/h1H
2 atoms
C  0.086756 0.0000 0.0000
H  -1.033795 0.0000 0.0000
totalener: -38.51283192 hartree
nucrepener: 2.83348254 hartree
electener: -41.34631446 hartree
oneelecener: -56.63972057 hartree
twoeener: 15.29340611 hartree
kineticenergy: 38.36253784 hartree
exchangeener: -3.593578697846 hartree
correlationener: -0.243921942283 hartree
xcener: -3.837500640130 hartree
s2: 0.752750
energy: -282.5044 -21.1266 -11.8053 -9.9234 -1.3189 2.8282 5.5512 5.5898 5.8398 7.8545 11.5857 14.0571 14.1465 15.4399 15.4697 20.3433 22.1338 22.7044 22.9331 23.4793 23.5310 27.4323 32.7833 46.1211 46.1604 48.2350 48.2369 48.3355 48.3441 51.7309 51.9987 52.1562 54.5104 55.7077 55.8231 64.3837 65.8202 65.8471 67.8986 68.0050 73.0586 75.2690 75.6499 87.9364 93.2842 93.3023 102.5643 129.7282 129.7399 132.3179 132.3230 135.9389 136.0111 146.6681 148.1151 148.1259 156.8116 156.8502 160.9553 161.1039 161.5611 161.6184 161.6482 162.9438 163.2732 166.8083 166.8100 171.3465 179.1469 179.4359 189.7347 199.0453 199.0977 203.4761 203.5436 205.5909 218.2776 219.1536 219.1582 231.7080 231.8064 257.5716 262.8678 262.9137 320.1298 750.5407 3985.8969 electronvolt
energy: -282.1782 -19.8919 -11.1737 -0.9260 0.0263 2.9699 5.6810 6.0320 6.5414 8.0424 11.8853 14.1603 14.5603 15.9126 15.9430 20.5295 22.3536 23.0804 23.4418 23.5562 24.1164 27.4817 33.0338 46.5556 46.5617 48.5145 48.8740 48.8830 49.3100 52.2217 53.2665 53.3009 55.0097 55.8082 56.4558 64.8673 66.0382 66.1114 67.8811 68.1610 73.1614 75.9545 76.8743 88.1308 93.4628 94.1267 102.9164 130.5846 130.5853 133.5552 133.5572 136.6287 136.6315 147.1389 148.3590 149.2093 157.0174 157.8658 161.7185 162.1786 162.5944 163.3607 163.3656 164.9122 164.9517 167.0146 167.0150 171.7532 179.7703 180.6760 190.8458 199.4691 199.4751 203.4443 203.7299 205.8176 218.4863 219.1260 219.1362 231.6518 231.8824 257.6589 262.9697 263.5249 320.4242 751.2085 3986.0233 electronvolt
chargesum: -0.0000000
charge: -0.029545 0.029545
charge: 0.244414 -0.244414
qa: -0.0295 0.0295
va: 1.8986 0.9297
dispersion: -0.000266982 hartree
energy: -38.513098900442 hartree
dipole: -0.96988 0.36957 -0.60031 0.00000 -0.00000 -0.00000 0.00000 0.00000 0.00000
magnitude: 0.60031 au
magnitude: 1.52586 debye
