program: Orca
programVersion: 5.0.4
elementType: C
charge: 0
multiplicity: 3
keywords: SP CCSD(T) aug-cc-pVTZ aug-cc-pVTZ/C TightSCF
keywords: NoFrozenCore
formula: C
InChI: InChI=1/C
1 atoms
C  0.0000 0.0000 0.0000
totalener: -37.69181115 hartree
nucrepener: 0.00000000 hartree
electener: -37.69181115 hartree
oneelecener: -50.44419352 hartree
twoeener: 12.75238238 hartree
kineticenergy: 37.68351673 hartree
s2: 2.010235
energy: -308.7550 -22.5741 -11.9408 -11.9408 0.4765 2.5705 2.6226 2.6226 3.3734 8.2770 8.2770 8.2840 8.2852 8.2852 14.4127 14.4127 15.8606 19.7366 27.7115 27.7115 28.1194 28.1194 28.2898 29.4059 29.4469 29.4469 29.5709 29.5709 29.7774 29.7774 63.5793 63.5793 64.5512 91.8807 91.8807 92.0494 92.0494 92.1153 93.4015 93.4679 93.4679 93.6664 93.6664 93.9949 93.9949 125.8964 electronvolt
energy: -307.5305 -15.8952 1.0252 1.7132 1.7132 2.8936 3.8478 4.9020 4.9020 8.4876 8.5791 8.5791 8.8767 8.8767 16.5062 17.7040 17.7040 21.3330 29.4059 29.6928 29.6928 29.7555 29.8478 29.8478 30.1279 30.1279 30.6091 30.6091 30.6586 30.6586 65.2438 66.7440 66.7440 93.6574 94.0969 94.0969 94.3822 94.5751 94.5751 95.1600 95.1600 95.4893 95.4893 96.1608 96.1608 127.4418 electronvolt
e0: -37.691811311 hartree
ecorr: -0.096941387 hartree
corrType: UHF
chargesum: 0.0000000
charge: 0.000000
energy: -37.791070430992 hartree
dipole: 0.00000 -0.00000 -0.00000 0.00000 0.00000 0.00000 0.00000 -0.00000 -0.00000
magnitude: 0.00000 au
magnitude: 0.00000 debye
dipolemethod: MDCI
