program: Gaussian 09
title: 000070610
version: EM64L-G09RevD.01
frameworkgroup: C1[X(C6H10O4)]
method: RPBEPBE
basis: SDD
operation: Freq
keyword: #pfreq=noraman
keyword: PBEPBE/SDD
title: #p freq=noraman PBEPBE/SDD
converged: NO YES NO NO
title: Mulliken charges:
elementType: O O O O C C C C C C H H H H H H H H H H
charge: -0.262528 -0.246646 -0.412658 -0.235576 -0.497904 -0.469285 0.253506 -0.228632 0.185408 -0.671145 0.266734 0.264061 0.270300 0.273823 0.229087 0.229159 0.212234 0.231064 0.230900 0.378096
chargesum: 0.00000
title: Mulliken charges with hydrogens summed into heavy atoms:
elementType: O O O O C C C C C C
charge: -0.262528 -0.246646 -0.034561 -0.235576 0.032891 0.074838 0.253506 0.229614 0.185408 0.003054
polarizability: 1.02756436e+02 3.08322250e+00 7.69499435e+01 5.97546393e-03 1.89464231e-01 5.21498029e+01
1716.lowfreq: -29.5016 -13.6921 -3.5166 0.0004 0.0006 0.0008 7.1973 35.2274 53.6870
frequency: -26.1782 30.9229 53.5755 75.6228 80.9269 147.1188 184.3000 233.5700 251.2263 314.7515 372.2826 495.5441 499.1144 543.4598 566.7215 635.6791 679.2323 786.6336 797.1109 804.7801 876.5694 921.2471 1019.3286 1021.3326 1045.6065 1099.3929 1114.3179 1135.8361 1141.9694 1151.4561 1240.6849 1247.6495 1265.1252 1308.9059 1355.9712 1385.3332 1399.5304 1437.8990 1445.8629 1463.1954 1473.6654 1486.4303 1635.2731 1665.9752 2994.7695 3009.3906 3016.0462 3023.0289 3058.6674 3068.1298 3080.1800 3091.3680 3107.1870 3515.9875
redmass: 5.9244 3.3718 2.9487 2.4112 3.7535 2.1001 4.9082 7.2767 1.2493 6.2758 3.7776 2.2172 2.6409 2.5969 5.6165 1.3188 6.0174 1.5818 1.1102 3.8470 4.5680 4.7919 2.3338 2.2801 2.7521 2.7525 2.2521 1.4665 2.9020 1.2159 1.5086 1.1352 1.1100 1.9639 1.4282 1.9856 1.2766 1.0954 1.0930 1.0404 1.0599 1.0690 9.8850 8.1674 1.0358 1.0581 1.0634 1.0603 1.0982 1.1067 1.0993 1.0985 1.1027 1.0640
irintensity: 2.5948 0.4045 0.2302 0.4897 1.6473 8.0521 7.8494 0.0523 1.3674 14.2002 1.1128 34.6469 40.5718 2.1708 29.9664 130.4659 0.8246 26.6650 1.5314 5.8100 27.6992 33.1074 107.1858 0.2261 122.5915 161.1517 2.5255 6.0503 241.0498 3.2037 35.9698 0.0099 0.4833 210.1579 10.0589 1.8803 19.8948 8.3625 59.2344 12.2058 4.7793 14.1089 230.3759 158.3259 20.2659 18.5532 0.3138 12.7655 0.0457 8.0840 8.6160 29.0586 44.9500 23.6556
temp: 298.150 k
press: 1.00000 atm
elementType: 8 8 8 8 6 6 6 6 6 6 1 1 1 1 1 1 1 1 1 1
symmnumber: 1
zpe: 411849.7 jmol-1
zpe.correction: 0.156865 hartree
zpe.thermalcorrener: 0.167679 hartree
zpe.thermalcorrenthalpy: 0.168623 hartree
zpe.thermalcorrgfe: 0.118533 hartree
zpe.sumelectzpe: -534.754192 hartree
zpe.sumelectthermal: -534.743378 hartree
zpe.sumelectthermalent: -534.742434 hartree
zpe.sumelectthermalfe: -534.792524 hartree
dipole: -1.0890 -0.2329 0.1055
dipole: 1.1186
quadrupole: -42.7597 -70.8065 -56.7373
quadrupole: 3.1337 0.1324 -0.0510
quadrupole: 14.0082 -14.0387 0.0305 3.1337 0.1324 -0.0510
hfenergy: -534.9110573 hartree
pointgroup: C01 [X(C6H10O4)]
dipole: 0.4267137 -0.0993467 -0.0416875 debye
dipolederiv: -1.6640681 0.3421237 0.0068849 0.3875994 -0.6127628 -0.0045647 0.0059841 -0.0046214 -0.2818888 -0.7096268 -0.0890849 -0.0002056 0.2995126 -0.9298749 -0.0067663 0.0055877 -0.0050785 -0.3013604 -1.0730117 0.5243927 -0.0322501 0.4587854 -0.5717622 0.0067992 -0.0274703 0.0066768 -0.4318258 -0.6935402 -0.1340139 0.0112093 0.1259923 -0.9652098 0.0429831 -0.006413 0.043645 -0.3116865 -0.2108574 -0.0904043 0.0003463 -0.2249447 -0.1354335 0.0036717 0.0082312 0.006295 0.1250813 -0.1982062 -0.0993426 0.0084296 -0.2910778 -0.149026 0.0147622 0.0116507 0.0107152 0.1285612 1.6912446 -0.140485 -0.0058646 -0.59575 1.2758478 0.0104171 -0.0132732 0.0087118 0.1765902 0.9040097 -0.0707144 -0.0017271 0.1073179 0.2321046 -0.0015078 0.0013352 -0.001198 0.3536567 1.5485947 -0.1817586 0.0048551 -0.2707778 1.3624463 -0.0749192 0.0112278 -0.0746199 0.1948328 -0.0970083 0.0858322 0.0012327 0.0689124 -0.0057787 -0.0007022 0.0008377 -0.0007468 0.0598624 0.0681944 -0.0017762 -0.0094705 0.0545897 0.065273 0.0726638 -0.007197 0.0787253 0.0014718 0.0618875 0.0019105 0.0108642 0.0540134 0.0561735 -0.0761675 0.0026949 -0.0848188 0.0043775 0.0740836 -0.0003127 -0.011081 0.0532794 0.0741615 0.0706325 -0.0115443 0.0791366 0.0009688 0.0850303 -0.0035395 0.0092156 0.0553355 0.0646887 -0.0747699 0.0087977 -0.0798053 0.018069 -0.0447015 0.0312584 -0.0207698 -0.0567904 -0.0024914 0.093109 0.0187465 0.1033552 -0.0587128 -0.0444377 0.0305253 0.0214952 -0.0564677 0.0017323 -0.0916103 -0.020103 -0.1020934 -0.0629308 -0.1496702 -0.0603349 -0.0003365 -0.0841989 0.0443023 -0.0007056 -0.0006265 -0.0007066 0.1161663 0.110859 -0.0213517 0.0378351 0.0331346 0.0053498 0.1016688 0.0106381 0.1171924 -0.059901 0.1106932 -0.0207655 -0.0387171 0.0330988 0.0098907 -0.1003057 -0.0102541 -0.1157667 -0.0647301 0.230531 -0.1021585 0.0080541 -0.1515641 0.180369 0.015312 0.0111497 0.0150022 0.3933983 unknown
polarizability: 102.6511728|-3.4952474|77.0333045|-0.2023582|-0.7313671|52.1717053 unknown
InChI: InChI=1S/C6H10O4/c1-2-10-6(9)4-3-5(7)8/h7H,2-4H2,1H3
charge 0 multiplicity 1
20 atoms
O  2.021257 -0.450246 -0.013971
O  1.026545 1.657217 0.009673
O  -4.0006 0.61547 -0.023716
O  -3.026827 -1.488211 0.110666
C  -0.37182 -0.388754 -0.003364
C  -1.599326 0.534663 -0.02913
C  0.923306 0.407578 -0.002252
C  3.369882 0.203095 -0.008024
C  -2.895576 -0.246732 0.027601
C  4.401368 -0.919644 -0.021194
H  -0.388313 -1.04575 0.885405
H  -0.369905 -1.075269 -0.869321
H  -1.606613 1.166836 -0.935838
H  -1.578711 1.247969 0.815193
H  3.440122 0.857383 -0.895891
H  3.441851 0.837868 0.893745
H  5.420319 -0.490865 -0.017592
H  4.292765 -1.565638 0.866754
H  4.290911 -1.546335 -0.922624
H  -4.838334 0.078666 0.018081
