program: Orca
programVersion: 5.0.4
elementType: C
charge: 0
multiplicity: 3
keywords: SP r2SCAN-3C def2-QZVP def2-TZVP/C def2/J TightSCF
keywords: NoFrozenCore
formula: C
InChI: InChI=1/C
1 atoms
C  0.0000 0.0000 0.0000
totalener: -37.83459537 hartree
nucrepener: 0.00000000 hartree
electener: -37.83459537 hartree
oneelecener: -50.46406506 hartree
twoeener: 12.62946969 hartree
kineticenergy: 37.71332202 hartree
exchangeener: -5.062410553164 hartree
correlationener: -0.146372595590 hartree
xcener: -5.208783148754 hartree
s2: 2.004900
energy: -276.7638 -15.1979 -6.5454 -6.5445 -5.0167 4.5445 4.5560 4.5562 5.0612 12.6421 12.6421 12.8628 12.8629 13.2706 20.4414 20.4422 20.9289 39.7060 45.9919 45.9919 46.0715 46.0717 46.2433 46.2434 46.2759 49.2480 49.2480 49.4541 49.4549 49.9948 74.8859 74.8864 75.5297 132.1867 132.3599 132.3599 132.5701 132.5739 132.6228 132.6309 132.6775 132.6780 160.7579 160.7598 161.2708 161.2712 161.4409 161.4561 161.4574 161.5764 161.5795 161.5799 161.7125 161.7169 186.7573 726.6290 3979.6690 electronvolt
energy: -275.8808 -12.1894 -4.1775 -2.6133 -2.6131 7.0292 7.5994 8.0160 8.0163 14.2266 14.4244 14.4247 15.0061 15.0063 23.8151 24.6053 24.6057 42.8204 47.5313 47.6783 47.6785 47.9720 47.9721 48.8006 48.8006 51.8822 52.1642 52.1646 53.3220 53.3221 78.0671 79.0101 79.0103 134.9515 135.0447 135.0450 135.1508 135.1508 135.6401 135.6402 136.9548 136.9548 165.2752 165.2767 165.2798 165.3069 165.3098 165.6205 165.6207 165.6241 166.6041 166.6043 166.8548 166.8550 191.5238 726.8149 3979.1181 electronvolt
chargesum: 0.0000000
charge: 0.000000
dispersion: 0.000000000 hartree
energy: -37.834595365012 hartree
dipole: 0.00000 -0.00000 -0.00000 0.00000 -0.00000 -0.00000 0.00000 -0.00000 -0.00000
magnitude: 0.00000 au
magnitude: 0.00000 debye
