program: Orca
programVersion: 5.0.4
elementType: C
charge: 0
multiplicity: 3
keywords: RIJCOSX PBEh-3c
formula: C
InChI: InChI=1/C
1 atoms
C  -4.69274 2.56432 -0.17557
totalener: -37.75397356 hartree
nucrepener: 0.00000000 hartree
electener: -37.75397356 hartree
oneelecener: -50.45515267 hartree
twoeener: 12.70117912 hartree
kineticenergy: 37.55564776 hartree
exchangeener: -2.803822468092 hartree
correlationener: -0.209850925647 hartree
xcener: -3.013673393738 hartree
s2: 2.002130
energy: -287.6204 -17.9777 -8.6448 -8.6448 -2.9444 13.5309 13.5309 14.5279 17.2476 45.9596 45.9596 46.2664 46.2665 46.5899 357.0162 electronvolt
energy: -286.7373 -14.0851 -1.8953 -0.4869 -0.4869 15.2716 16.3636 16.3636 19.0979 48.1154 48.5554 48.5554 49.8565 49.8565 358.2311 electronvolt
chargesum: -0.0000000
charge: -0.000000
dispersion: 0.000000000 hartree
energy: -37.753973556534 hartree
dipole: 0.00000 -0.00001 -0.00001 0.00000 -0.00001 -0.00001 0.00000 -0.00001 -0.00001
magnitude: 0.00002 au
magnitude: 0.00004 debye
