program: Gaussian 09
title: 000070674
version: EM64L-G09RevD.01
frameworkgroup: C1[X(C24H16N2O)]
method: RPBEPBE
basis: SDD
operation: Freq
keyword: #p
keyword: freq=noraman
keyword: PBEPBE/SDD
title: #p freq=noraman PBEPBE/SDD
converged: NO YES NO NO
title: Mulliken charges:
elementType: O N N C C C C C C C C C C C C C C C C C C C C C C C C H H H H H H H H H H H H H H H H
charge: -0.267902 -0.125609 -0.128100 0.376225 0.383512 0.328067 -0.550260 0.262736 0.311525 -0.408647 -0.389999 0.091915 0.266664 -0.412267 0.100445 -0.408600 -0.367359 -0.370121 -0.362795 -0.350908 -0.240886 -0.236366 -0.382859 -0.382869 -0.218520 -0.218516 -0.238403 0.281081 0.240343 0.256340 0.246505 0.241320 0.250501 0.252145 0.254699 0.274312 0.232507 0.231258 0.245509 0.245510 0.228661 0.228661 0.230545
chargesum: 0.00000
title: Mulliken charges with hydrogens summed into heavy atoms:
elementType: O N N C C C C C C C C C C C C C C C C C C C C C C C C
charge: -0.267902 -0.125609 -0.128100 0.376225 0.383512 0.328067 -0.269179 0.262736 0.311525 -0.168304 -0.133658 0.091915 0.266664 -0.165761 0.100445 -0.167280 -0.116858 -0.117976 -0.108096 -0.076595 -0.008379 -0.005108 -0.137350 -0.137359 0.010141 0.010144 -0.007858
polarizability: 6.13103891e+02 -1.93119229e+00 2.33841491e+02 -5.96645160e-03 1.58189221e-03 1.45682348e+02
1716.lowfreq: -60.6477 -3.3980 -0.0011 -0.0007 0.0010 3.7153 6.2538 17.3636 29.3286
frequency: -60.6251 17.1165 29.3259 31.1598 43.7076 73.4969 77.0873 111.8165 127.9343 165.6177 170.2958 184.4162 244.7887 266.8507 293.0426 317.3058 324.5783 394.7212 396.3824 400.2817 412.8106 422.9924 433.0164 479.7647 508.1164 512.8735 516.5631 540.4459 549.4817 589.5474 615.0807 630.7526 634.7534 640.0453 650.5275 667.9937 701.9856 705.7932 749.0010 751.6731 757.1664 763.4593 769.0372 790.4786 831.5404 837.3356 850.5066 853.5144 859.6408 883.3544 884.8018 897.7676 919.9845 931.9108 939.6243 956.0784 969.4052 973.9423 974.8885 986.7021 986.9516 989.0611 989.5591 995.5325 996.1380 996.5555 1020.3131 1023.4798 1040.8370 1065.4926 1077.6051 1115.0392 1131.3609 1159.9353 1172.5443 1174.5220 1183.2592 1187.0439 1194.0700 1228.6858 1246.4923 1265.6119 1277.3569 1287.5386 1304.5069 1309.0919 1354.4833 1360.1697 1368.1094 1409.6064 1410.8209 1422.8745 1427.6249 1435.3183 1440.5506 1449.9095 1482.3722 1497.1354 1532.2709 1541.2890 1564.8944 1577.1987 1582.9683 1608.8909 1610.8253 1624.3797 1638.6498 3123.4829 3123.8851 3129.4507 3130.2010 3132.0622 3140.7240 3141.4965 3142.5472 3145.8225 3147.3645 3150.4269 3163.5366 3164.6285 3165.4861 3168.0060 3168.5384
redmass: 3.7862 5.2413 6.3031 3.9099 6.1222 5.5185 6.7762 7.2405 6.0260 6.6206 6.4118 3.6657 6.0844 6.5771 5.2121 5.1791 5.5963 3.6178 2.9825 2.8816 4.7190 5.3348 7.3197 2.5182 6.9032 6.2240 3.8893 3.4793 2.9967 7.1900 6.1461 6.6953 6.8561 4.3466 6.8824 5.6399 4.2586 1.7044 6.2502 3.7910 4.8676 1.4048 1.9459 2.6686 6.5132 1.3423 1.3394 1.3346 1.3671 1.5651 13.5416 13.1727 1.4055 5.6579 1.5313 9.6894 1.4177 1.3828 1.3574 1.3832 6.2140 1.3673 6.5510 1.3111 6.9827 1.3605 2.6335 2.3252 1.9709 3.0299 1.6048 1.4252 1.7027 1.4000 1.0531 1.0876 2.0848 1.1154 1.2239 2.2747 1.8061 3.1033 1.7676 2.7736 1.3301 1.3756 3.4945 2.2242 6.6735 5.1434 3.8604 2.6621 2.2032 4.4435 3.1943 2.7672 2.7988 3.9284 4.9095 5.4709 7.3762 7.3184 5.9818 5.7195 6.1694 6.4168 6.7365 1.0862 1.0845 1.0877 1.0889 1.0888 1.0886 1.0919 1.0895 1.0949 1.0928 1.0969 1.0960 1.1005 1.1018 1.0975 1.0959
irintensity: 0.0289 0.0758 0.3639 0.0312 0.5532 0.0053 0.9939 1.4438 0.4408 0.1827 0.1836 0.8801 0.9168 1.0238 0.5456 0.2573 0.1968 0.0009 0.0008 0.0004 0.0544 4.5660 3.2576 25.0298 5.0399 0.9476 0.2873 16.8071 16.0182 6.5813 0.1072 0.2142 0.2722 0.0305 0.1864 4.4961 11.7486 54.0234 5.7217 0.2491 0.3092 63.4098 45.8769 0.0732 6.6323 36.1315 18.6314 17.5399 20.8424 24.8215 6.9450 33.9937 1.6852 14.1117 11.5389 11.2796 10.3588 0.1648 1.4982 3.0181 0.1492 0.5043 13.8399 0.0802 24.7402 0.0070 0.8963 4.6744 5.1510 2.9120 7.5714 5.6008 8.3703 8.6355 0.0257 0.0974 0.8944 5.1632 4.2360 23.4073 6.6338 4.2053 9.0922 0.7508 0.2791 0.6598 2.1096 7.6686 0.1083 8.0254 35.0647 13.2564 7.6509 76.3027 18.6854 132.3969 1.4806 67.2814 21.2741 2.7785 1.4065 0.6163 1.4770 5.4321 24.9699 14.3054 4.0867 2.4515 2.9767 0.1888 0.5462 7.5914 8.8957 24.2816 4.4617 23.1269 5.6026 37.0713 8.1653 48.6804 28.3616 2.0440 5.8211
temp: 298.150 k
press: 1.00000 atm
elementType: 8 7 7 6 6 6 6 6 6 6 6 6 6 6 6 6 6 6 6 6 6 6 6 6 6 6 6 1 1 1 1 1 1 1 1 1 1 1 1 1 1 1 1
symmnumber: 1
zpe: 861974.4 jmol-1
zpe.correction: 0.328309 hartree
zpe.thermalcorrener: 0.348018 hartree
zpe.thermalcorrenthalpy: 0.348962 hartree
zpe.thermalcorrgfe: 0.277525 hartree
zpe.sumelectzpe: -1107.068921 hartree
zpe.sumelectthermal: -1107.049211 hartree
zpe.sumelectthermalent: -1107.048267 hartree
zpe.sumelectthermalfe: -1107.119705 hartree
dipole: 0.2264 -3.6854 0.0000
dipole: 3.6923
quadrupole: -108.4753 -155.3720 -156.4746
quadrupole: 3.9299 -0.0006 0.0003
quadrupole: 31.6320 -15.2647 -16.3673 3.9299 -0.0006 0.0003
hfenergy: -1107.3972293 hartree
pointgroup: C01 [X(C24H16N2O1)]
dipole: 0.0920111 1.4497638 -0.0009218 debye
polarizability: 613.1101597|1.1627186|233.835187|0.0131912|-0.055584|145.6823832 unknown
InChI: InChI=1S/C24H16N2O/c1-2-6-17(7-3-1)19-10-13-20(14-11-19)23-25-26-24(27-23)22-15-12-18-8-4-5-9-21(18)16-22/h1-16H
charge 0 multiplicity 1
43 atoms
O  -0.760387 -0.064667 0.000282
N  -1.737405 -2.127228 0.001622
N  -0.316769 -2.303184 0.001545
C  -5.70706 -0.176982 0.000144
C  -5.74947 1.273767 -0.000685
C  -3.245602 -0.099916 0.000227
C  -4.441648 -0.837852 0.000587
C  4.412153 -0.038311 0.000411
C  1.642137 -0.710627 0.00081
C  -4.51198 2.00059 -0.001028
C  -3.28791 1.338117 -0.000587
C  -1.971377 -0.805424 0.000694
C  5.871467 0.314912 0.000116
C  -6.94175 -0.909716 0.000497
C  0.233189 -1.07932 0.000985
C  -7.022012 1.93165 -0.001131
C  3.419369 0.977012 0.000076
C  3.994518 -1.397015 0.00097
C  2.048918 0.650418 0.000268
C  2.62875 -1.734771 0.001164
C  -8.166841 -0.240324 0.000049
C  -8.207429 1.191481 -0.000774
C  6.57303 0.482324 -1.222462
C  6.573372 0.483159 1.222383
C  7.947767 0.811462 -1.222531
C  7.948109 0.812297 1.221836
C  8.639591 0.97763 -0.000501
H  -4.394147 -1.932456 0.001211
H  -4.541824 3.096408 -0.001649
H  -2.348395 1.898546 -0.000855
H  -6.907152 -2.005424 0.001126
H  -7.053269 3.027706 -0.001755
H  3.728853 2.027749 -0.000349
H  4.750613 -2.18946 0.001232
H  1.292374 1.441285 -0.000005
H  2.30726 -2.781099 0.001578
H  -9.103907 -0.80736 0.000325
H  -9.175594 1.704072 -0.001122
H  6.039103 0.352992 -2.170782
H  6.039714 0.354478 2.170943
H  8.476439 0.937078 -2.174155
H  8.477051 0.938567 2.173223
H  9.705255 1.232537 -0.000737
