program: Orca
programVersion: 5.0.4
elementType: C H H
charge: 0
multiplicity: 3
keywords: Opt RIJCOSX CCSD(T) NUMGRAD cc-pVtz cc-pVtz/C
formula: CH2
InChI: InChI=1/CH2/h1H2
3 atoms
C  -6.567954 2.612178 0.029786
H  -5.49085 2.626263 -0.020447
H  -7.346756 2.813549 -0.688359
totalener: -38.93713345 hartree
nucrepener: 6.17793459 hartree
electener: -45.11506804 hartree
oneelecener: -63.95920636 hartree
twoeener: 18.84413832 hartree
kineticenergy: 38.90752756 hartree
s2: 2.018149
e0: -38.937133199 hartree
ecorr: -0.136981297 hartree
corrType: UHF
s2: 2.017698
e0: -38.937354771 hartree
ecorr: -0.136949360 hartree
s2: 2.016476
e0: -38.937713881 hartree
ecorr: -0.136798825 hartree
s2: 2.016298
e0: -38.937767807 hartree
ecorr: -0.136759284 hartree
s2: 2.016273
e0: -38.937781799 hartree
ecorr: -0.136747875 hartree
energy: -306.5274 -25.8093 -16.7901 -12.2787 -11.1334 4.2768 5.6944 10.6630 11.2154 11.7852 12.1792 16.4886 18.2642 19.3974 21.4008 21.5995 26.7782 29.0363 31.2445 33.4826 35.8468 38.1737 40.9976 49.4206 63.3092 63.8511 64.6641 66.6195 76.4935 78.2581 78.2965 78.8544 83.4679 84.0443 85.4320 87.3548 87.9019 89.2192 91.2247 97.2478 98.9046 103.3309 106.2308 108.0081 108.4887 113.0271 114.3940 114.9164 116.3831 131.9031 139.2489 141.4021 143.1433 147.3756 150.3014 158.9886 163.7070 310.7363 electronvolt
energy: -305.2433 -21.1352 -15.9594 3.1167 3.7007 4.7345 6.0191 11.7030 11.8110 15.6736 15.6982 17.5353 19.5176 20.8234 24.2657 24.6143 27.0147 30.2132 31.9502 34.6442 36.8750 38.8246 41.5070 50.4623 65.0865 65.6440 66.4458 68.4988 77.4951 79.6097 80.2293 80.9129 84.3950 85.8206 86.8333 88.8488 91.0938 91.9885 92.8538 97.7341 99.1584 104.0086 106.6071 108.3455 108.9742 113.1372 114.5808 115.1144 116.5052 132.3148 139.5823 142.0592 143.7743 147.8057 150.7883 159.4027 164.1112 311.6085 electronvolt
e0: -38.937782857 hartree
ecorr: -0.136747899 hartree
chargesum: -0.0000000
charge: -0.338169 0.168909 0.169260
charge: 0.219643 -0.109824 -0.109819
qa: -0.3382 0.1689 0.1693
va: 3.9101 0.9947 0.9942
energy: -39.077921840975 hartree
dipole: 0.23964 -0.15411 0.08552 0.17308 -0.11129 0.06180 -0.61727 0.39695 -0.22031
magnitude: 0.24428 au
magnitude: 0.62090 debye
dipolemethod: MDCI
