program: Orca
programVersion: 5.0.4
elementType: C H H
charge: 0
multiplicity: 3
keywords: Opt RIJCOSX NoFrozenCore MP2 cc-pVtz cc-pVtz/C
formula: CH2
InChI: InChI=1/CH2/h1H2
3 atoms
C  -6.567605 2.612419 0.028927
H  -5.500262 2.627077 -0.023349
H  -7.337693 2.812494 -0.684598
totalener: -38.93713345 hartree
nucrepener: 6.17793459 hartree
electener: -45.11506804 hartree
oneelecener: -63.95920636 hartree
twoeener: 18.84413832 hartree
kineticenergy: 38.90752756 hartree
s2: 2.018149
s2: 2.017251
total: -39.068920122 hartree
s2: 2.016267
s2: 2.015846
s2: 2.015856
s2: 2.015871
energy: -306.4721 -25.8868 -16.8811 -12.3015 -11.1322 4.3040 5.7134 10.6912 11.1733 11.7827 12.1894 16.5923 18.3824 19.4485 21.4055 21.6065 26.9447 29.1126 31.3588 33.4209 35.8613 38.2938 41.0885 49.8385 63.3346 63.8247 64.4233 66.5151 76.4519 78.2570 78.4325 78.8594 83.6717 84.1839 85.4291 87.3118 87.9231 89.1692 91.1776 97.6652 99.2899 103.4268 106.5487 108.4882 108.9223 113.2822 114.6318 115.2067 116.7906 132.6939 140.2056 142.3471 143.6012 148.4943 151.0355 159.3462 164.3507 315.4009 electronvolt
energy: -305.1917 -21.2353 -16.0450 3.1207 3.6993 4.7491 6.0297 11.7577 11.7688 15.6623 15.6844 17.6401 19.6415 20.8873 24.2837 24.6326 27.1802 30.2863 32.0640 34.5721 36.8830 38.9494 41.6037 50.8830 64.8530 65.5267 66.4659 68.4956 77.4663 79.7557 80.2293 80.9152 84.5927 85.9891 86.8497 88.8002 91.0979 91.9039 92.8005 98.1410 99.5389 104.0947 106.9246 108.8257 109.4108 113.4040 114.8315 115.4130 116.9299 133.1171 140.5441 143.0118 144.2358 148.9157 151.5285 159.7649 164.7534 316.2693 electronvolt
chargesum: -0.0000000
charge: -0.337620 0.168950 0.168670
charge: 0.231251 -0.115621 -0.115630
qa: -0.3376 0.1690 0.1687
va: 3.8869 0.9924 0.9923
energy: -39.069155552740 hartree
dipole: 0.23880 -0.15459 0.08421 0.17250 -0.11159 0.06091 -0.61520 0.39841 -0.21679
magnitude: 0.24041 au
magnitude: 0.61108 debye
dipolemethod: MP2 RELAXED
