program: Orca
programVersion: 5.0.4
elementType: C H H
charge: 0
multiplicity: 3
keywords: RIJCOSX NumFreq NoFrozenCore MP2 DEF2-QZVPP DEF2-QZVPP/C
frequency: 0.00 0.00 0.00 0.00 0.00 0.00 1132.37 3214.34 3451.52
frequency: 1132.37 3214.34 3451.52
formula: CH2
InChI: InChI=1/CH2/h1H2
3 atoms
C  -6.567539 2.612484 0.028694
H  -5.49873 2.626887 -0.022669
H  -7.339292 2.812619 -0.685044
totalener: -38.94086846 hartree
nucrepener: 6.20339236 hartree
electener: -45.14426081 hartree
oneelecener: -64.00273937 hartree
twoeener: 18.85847856 hartree
kineticenergy: 38.93523054 hartree
s2: 2.016033
energy: -306.4971 -25.8887 -16.8963 -12.3180 -11.1436 3.1864 4.6001 5.7160 5.9290 6.2417 8.0780 13.0470 13.9078 14.9702 15.9824 16.0915 20.0699 20.6980 23.0266 23.7441 24.0298 25.0466 25.2060 26.0655 26.1854 32.2933 33.2350 36.7792 40.0497 50.5822 50.8781 51.3605 53.7510 54.6685 55.0166 55.6199 55.9112 57.4231 58.3378 59.0234 62.0312 66.5537 69.1949 69.8918 71.1452 72.6602 74.3701 75.5168 76.4737 77.8183 78.9878 79.3465 79.8836 94.0250 96.5750 99.9135 104.5307 104.6731 108.6691 109.7357 118.2000 137.5803 137.7425 144.8559 146.3381 147.7540 153.3401 156.5170 156.6681 162.1666 163.2711 164.6540 164.8567 167.4669 167.6975 171.8175 172.2151 172.5957 173.0892 175.8432 177.3464 181.8999 184.1767 187.3242 191.6173 192.2562 194.0297 202.5637 208.2652 211.7529 211.9682 212.6483 212.7877 212.9747 216.1024 216.1915 216.8199 230.0342 230.3962 231.4238 231.5414 233.8392 238.3689 244.1943 244.1967 244.9819 245.4873 275.7632 277.9643 282.4264 283.7472 289.5070 305.1993 320.0868 349.0757 798.4687 4074.7319 electronvolt
energy: -305.2148 -21.2454 -16.0677 2.3861 2.7951 3.5148 4.7822 6.4628 7.8090 8.8827 9.1501 14.0027 14.9927 16.1055 18.0346 18.2426 20.4136 21.5000 23.6407 24.0921 25.6747 25.9336 26.7009 27.2814 28.1929 32.5910 33.4356 37.4306 40.6238 52.0345 52.3427 52.9297 54.9752 56.2234 56.7799 57.6541 57.9949 58.4306 59.4332 60.3124 62.8516 67.1095 69.6192 70.7004 71.7410 73.7030 74.6917 76.3816 76.8606 78.2083 79.1161 79.8174 81.7648 94.4459 96.8524 100.7479 105.2284 105.7067 109.3411 110.7512 118.6355 138.9412 139.1216 145.6822 147.2135 148.5883 154.1356 157.2834 157.5396 163.4549 164.3327 165.5812 166.1599 168.9474 169.6572 172.7212 172.8430 173.2281 173.5905 176.6302 178.1269 182.2698 185.2172 188.4578 192.8351 192.9541 195.1761 203.0497 208.4664 211.8947 212.1448 212.8207 213.0525 213.2401 216.2108 216.2990 217.0336 230.3104 230.4475 231.4706 231.6940 234.1105 238.6693 244.2479 244.2697 245.0620 245.6360 275.9696 278.2094 282.7767 284.1347 289.7230 305.4390 320.2736 349.5282 799.0387 4074.9605 electronvolt
chargesum: -0.0000000
charge: -0.272342 0.136195 0.136147
charge: 0.412766 -0.206350 -0.206416
qa: -0.2723 0.1362 0.1361
va: 3.9007 1.0066 1.0063
energy: -39.089326431206 hartree
dipole: 0.23864 -0.15502 0.08361 0.17235 -0.11190 0.06045 -0.61464 0.39913 -0.21551
magnitude: 0.23893 au
magnitude: 0.60732 debye
dipolemethod: MP2 RELAXED
temp: 298.15 k
press: 1.00 atm
zeropoint: 0.01776566 hartree
thermalvibcorrection: 0.00002195 hartree
thermalrotcorrection: 0.00141627 hartree
thermaltrasncorrection: 0.00141627 hartree
thermaltotal: -39.06870628 hartree
thermalcorr: 0.00285449 hartree
nonthermalcorr: 0.01776566 hartree
totalcorr: 0.02062016 hartree
thermalcorrenthalpy: 0.00094421 hartree
totalenthalpy: -39.06776207 hartree
vibrat: 0.00002597 hartree
rotat: 0.00500210 hartree
transl: 0.01608942 hartree
total: 0.02215478 hartree
totalentropycorr: -0.02215478 hartree
gibbsenthalpy: -39.08991685 hartree
gibbsminuselec: -0.00059041 hartree
