program: Orca
programVersion: 5.0.4
elementType: C H H
charge: 0
multiplicity: 3
keywords: Freq RIJCOSX PBEh-3c
frequency: 0.00 0.00 0.00 0.00 0.00 0.00 1113.95 3247.25 3475.79
frequency: 1113.95 3247.25 3475.79
formula: CH2
InChI: InChI=1/CH2/h1H2
3 atoms
C  -6.567705 2.612375 0.029082
H  -5.493352 2.626404 -0.02095
H  -7.344503 2.81321 -0.687152
totalener: -39.06330250 hartree
nucrepener: 6.17176836 hartree
electener: -45.23507087 hartree
oneelecener: -63.96513316 hartree
twoeener: 18.73006230 hartree
kineticenergy: 38.80535443 hartree
exchangeener: -3.248700954231 hartree
correlationener: -0.294538352461 hartree
xcener: -3.543239306692 hartree
s2: 2.007115
energy: -285.1780 -20.8411 -13.9844 -9.1829 -8.1592 4.2195 6.6548 13.7321 13.8504 14.0130 17.9340 27.2876 29.4198 45.7262 46.2401 46.3161 57.5516 60.3612 364.7106 electronvolt
energy: -284.2720 -18.1103 -13.2967 -0.7512 -0.0157 4.9861 7.4801 14.5679 16.0973 17.0734 19.7249 28.5130 30.2174 48.1070 50.2154 50.4220 59.1951 62.1382 365.9869 electronvolt
chargesum: -0.0000000
charge: -0.440777 0.220359 0.220418
charge: -0.265845 0.132920 0.132925
qa: -0.4408 0.2204 0.2204
va: 3.7743 0.9263 0.9262
dispersion: -0.000282985 hartree
energy: -39.063024118748 hartree
dipole: 0.23904 -0.14421 0.09483 0.17261 -0.10406 0.06855 -0.61557 0.37128 -0.24429
magnitude: 0.27086 au
magnitude: 0.68848 debye
temp: 298.15 k
press: 1.00 atm
zeropoint: 0.01785398 hartree
thermalvibcorrection: 0.00002361 hartree
thermalrotcorrection: 0.00141627 hartree
thermaltrasncorrection: 0.00141627 hartree
thermaltotal: -39.04231399 hartree
thermalcorr: 0.00285615 hartree
nonthermalcorr: 0.01785398 hartree
totalcorr: 0.02071013 hartree
thermalcorrenthalpy: 0.00094421 hartree
totalenthalpy: -39.04136978 hartree
vibrat: 0.00002800 hartree
rotat: 0.00501385 hartree
transl: 0.01608942 hartree
total: 0.02216856 hartree
totalentropycorr: -0.02216856 hartree
gibbsenthalpy: -39.06353834 hartree
gibbsminuselec: -0.00051422 hartree
