program: Orca
programVersion: 5.0.4
elementType: C H H
charge: 0
multiplicity: 3
keywords: Opt RIJCOSX NoFrozenCore MP2 def2-SVP def2-SVP/C
formula: CH2
InChI: InChI=1/CH2/h1H2
3 atoms
C  -6.572431 2.608935 0.041352
H  -5.489679 2.627992 -0.026612
H  -7.34345 2.815063 -0.693759
totalener: -38.89374955 hartree
nucrepener: 6.17793459 hartree
electener: -45.07168414 hartree
oneelecener: -63.88655411 hartree
twoeener: 18.81486997 hartree
kineticenergy: 38.72515839 hartree
s2: 2.017968
s2: 2.017550
total: -38.988980697 hartree
s2: 2.016334
s2: 2.015755
s2: 2.015688
s2: 2.015690
energy: -306.6972 -25.4389 -16.6842 -12.3831 -11.2087 5.5414 6.9620 15.1956 17.0013 17.8947 18.3006 23.0702 25.3524 38.1743 44.1654 45.4994 46.4214 55.7553 59.7395 63.4634 66.9171 69.4984 85.0746 90.9036 electronvolt
energy: -305.3053 -20.8443 -15.8031 3.5034 4.3041 6.2360 7.5380 16.2726 19.2897 21.2871 22.5274 24.5262 26.5108 39.7476 46.3123 46.7779 48.0883 58.9043 62.5043 64.8667 68.0766 71.4530 85.9922 91.8737 electronvolt
chargesum: 0.0000000
charge: -0.169836 0.084921 0.084915
charge: -0.021101 0.010554 0.010547
qa: -0.1698 0.0849 0.0849
va: 3.9313 0.9892 0.9892
energy: -38.989396393495 hartree
dipole: 0.25043 -0.16731 0.08312 0.18090 -0.12065 0.06025 -0.64514 0.43111 -0.21404
magnitude: 0.23738 au
magnitude: 0.60338 debye
dipolemethod: MP2 RELAXED
