program: Orca
programVersion: 5.0.4
elementType: C H H H
charge: 0
multiplicity: 2
keywords: Opt RIJCOSX NoFrozenCore MP2 cc-pVtz cc-pVtz/C
formula: CH3
InChI: InChI=1/CH3/h1H3
4 atoms
C  -5.591957 1.964771 -0.064611
H  -4.582381 2.309513 0.02646
H  -6.09639 1.553802 0.785632
H  -6.096182 2.031124 -1.0069
totalener: -39.54224358 hartree
nucrepener: 10.38660854 hartree
electener: -49.92885213 hartree
oneelecener: -72.82594934 hartree
twoeener: 22.89709722 hartree
kineticenergy: 39.91131201 hartree
s2: 0.759904
s2: 0.761120
total: -39.747844328 hartree
s2: 0.761290
s2: 0.761532
s2: 0.761468
s2: 0.761389
s2: 0.761364
s2: 0.761363
energy: -305.5908 -25.8494 -15.8539 -15.8470 -10.4587 4.1054 6.0636 6.0654 10.2388 10.2448 11.9898 13.3425 16.9780 18.1924 18.1986 19.9599 19.9655 28.1459 29.0926 29.7682 29.7763 31.6241 34.5271 34.5375 39.2675 39.2710 42.2217 42.2261 49.7858 64.3920 64.8122 69.0085 69.0115 77.2818 77.2864 79.2712 79.2796 86.2184 87.0789 87.6390 87.9419 87.9545 88.9842 89.0055 95.2715 96.6612 100.6892 100.6963 106.6840 106.6949 108.0562 108.0649 113.6563 114.9643 115.4216 116.6371 116.6439 120.4043 120.4181 136.3530 141.7097 141.7458 142.7510 142.8447 142.8691 144.9784 144.9911 161.8009 164.1933 164.2309 179.8465 366.2878 electronvolt
energy: -304.9713 -23.3839 -15.4664 -15.4591 3.3208 4.3758 6.1830 6.1850 10.3191 10.3251 14.6154 15.3428 17.6928 18.4544 18.4600 21.3287 21.3330 28.0710 29.9206 29.9290 30.3712 32.1965 35.1850 35.1972 39.3873 39.3911 42.3941 42.3983 50.2534 65.0722 67.0158 69.4338 69.4378 77.8977 77.9027 80.3439 80.3536 86.2715 88.1606 88.2840 88.2950 89.4740 90.0359 90.0517 95.3520 96.8353 100.7148 100.7222 106.8002 106.8112 108.3108 108.3198 113.5821 115.0004 115.4783 116.5695 116.5765 120.5676 120.5818 136.6177 141.8167 141.8542 142.9060 142.9281 142.9584 145.5250 145.5378 162.0096 164.3151 164.3528 179.9310 366.7691 electronvolt
chargesum: -0.0000000
charge: -0.437821 0.145626 0.146825 0.145369
charge: 0.222846 -0.074291 -0.074279 -0.074276
qa: -0.4378 0.1456 0.1468 0.1454
va: 3.9520 0.9888 0.9882 0.9891
energy: -39.750932734383 hartree
dipole: 0.00069 -0.00058 0.00010 0.00009 -0.00002 0.00007 -0.00073 0.00068 -0.00005
magnitude: 0.00014 au
magnitude: 0.00035 debye
dipolemethod: MP2 RELAXED
