program: Gaussian 09
title: 000070601
version: EM64L-G09RevD.01
frameworkgroup: C1[X(C7H18O3Si)]
method: RPBEPBE
basis: SDD
operation: Freq
keyword: #p
keyword: freq=noraman
keyword: PBEPBE/SDD
title: #p freq=noraman PBEPBE/SDD
converged: YES YES NO NO
title: Mulliken charges:
elementType: Si O O O C C C C C C C H H H H H H H H H H H H H H H H H H
charge: 1.539923 -0.591428 -0.576614 -0.577128 -0.923353 -0.289255 -0.340145 -0.692502 -0.477460 -0.491495 -0.491260 0.251456 0.251649 0.204462 0.204412 0.191839 0.191776 0.210592 0.216985 0.210622 0.218102 0.217709 0.226632 0.237094 0.215132 0.205135 0.205073 0.214986 0.237059
chargesum: 0.00000
title: Mulliken charges with hydrogens summed into heavy atoms:
elementType: Si O O O C C C C C C C
charge: 1.539923 -0.591428 -0.576614 -0.577128 -0.420248 0.119619 0.043471 -0.054303 0.184983 0.165866 0.165858
polarizability: 1.22582212e+02 8.44316292e-04 1.06619649e+02 2.31833147e+00 5.72139810e-03 9.08169827e+01
1716.lowfreq: -65.9288 -0.0007 0.0007 0.0007 4.1789 10.6799 11.2913 23.8661 37.8875
frequency: -65.6147 14.9670 37.6505 53.3752 58.9322 65.4885 76.9024 83.9875 85.6199 114.9805 115.7161 143.6029 149.0778 215.9742 219.2581 237.1404 249.2700 294.7606 342.1833 400.4479 412.3427 566.7300 683.4512 711.9143 732.5703 779.2369 785.8105 886.4496 892.2108 1017.0953 1034.8253 1045.3113 1052.4154 1068.1018 1069.2964 1095.1376 1119.2865 1122.7464 1123.0201 1143.0065 1146.6175 1150.9742 1199.8629 1227.8693 1270.9804 1295.0071 1307.5834 1349.8365 1391.8227 1428.0973 1443.9991 1446.5085 1449.5315 1467.6230 1467.8233 1469.8912 1470.3516 1474.1768 1474.5368 1475.8070 1477.2970 1478.3073 1488.7989 2939.7871 2941.5533 2958.0016 2963.6624 2972.8012 2974.5497 2988.1346 3002.1785 3021.2404 3021.9594 3026.6519 3044.2927 3049.1361 3071.3167 3073.2443 3086.8343 3087.0422 3091.1321
redmass: 1.0825 2.7253 3.1606 2.8557 1.5929 3.5479 2.3458 1.0739 1.1676 2.9002 2.4582 3.7586 2.4951 3.7112 1.5830 2.0351 4.3196 5.4147 5.8018 3.0758 7.2277 6.0930 2.6288 8.8357 1.1959 1.4809 5.9604 1.8495 1.3113 4.0138 1.3098 6.5064 3.5570 4.3573 2.8799 1.9331 1.2522 1.2545 1.2531 1.3802 1.4315 1.4882 1.5326 1.3599 1.1982 1.0623 1.3660 1.5252 1.2141 1.0809 1.1217 1.1223 1.1152 1.0518 1.0580 1.0561 1.0516 1.0560 1.0516 1.0516 1.0419 1.0646 1.0843 1.0332 1.0335 1.0311 1.0587 1.0599 1.0369 1.0586 1.0991 1.1025 1.1025 1.1024 1.1036 1.1013 1.1006 1.0994 1.0992 1.0991 1.1017
irintensity: 0.0884 0.1936 0.1461 7.1880 0.0103 1.4215 3.1504 0.8740 1.1233 4.5226 1.2739 24.4182 9.9316 7.9106 2.5850 2.4785 2.7346 9.4880 15.7900 2.1445 53.0690 32.6359 12.2554 114.3801 30.9057 24.8882 89.7558 7.3255 24.8880 29.7113 25.4491 247.5268 422.3600 15.5856 2.2611 17.1531 0.1144 1.2851 0.6359 24.9984 75.1162 0.1999 3.6556 24.4499 2.5099 0.0686 3.4637 0.3384 12.8554 14.1296 0.7993 0.0647 3.9744 13.0192 4.7132 11.8190 0.3699 4.9832 0.2344 6.0219 12.6812 5.1182 15.9585 145.9737 14.4085 78.9172 8.8279 31.8714 40.3121 34.3661 0.5623 3.6705 127.5901 9.8669 49.9048 35.2808 84.3494 50.4063 15.6311 57.8657 34.0618
temp: 298.150 k
press: 1.00000 atm
elementType: 14 8 8 8 6 6 6 6 6 6 6 1 1 1 1 1 1 1 1 1 1 1 1 1 1 1 1 1 1
symmnumber: 1
zpe: 642796.1 jmol-1
zpe.correction: 0.244828 hartree
zpe.thermalcorrener: 0.261651 hartree
zpe.thermalcorrenthalpy: 0.262595 hartree
zpe.thermalcorrgfe: 0.197130 hartree
zpe.sumelectzpe: -791.716094 hartree
zpe.sumelectthermal: -791.699271 hartree
zpe.sumelectthermalent: -791.698327 hartree
zpe.sumelectthermalfe: -791.763792 hartree
dipole: -0.4125 -0.0013 1.6575
dipole: 1.7081
quadrupole: -70.3912 -64.9874 -84.7971
quadrupole: -0.0105 1.6596 0.0024
quadrupole: 3.0007 8.4045 -11.4052 -0.0105 1.6596 0.0024
hfenergy: -791.960922 hartree
pointgroup: C01 [X(C7H18O3Si1)]
dipole: -0.1676992 -0.0048616 0.6507254 debye
polarizability: 122.5413468|-0.0885293|106.6190632|2.5804295|0.1178512|90.8584336 unknown
InChI: InChI=1S/C7H18O3Si/c1-5-6-7-11(8-2,9-3)10-4/h5-7H2,1-4H3
charge 0 multiplicity 1
29 atoms
Si 0.888461 -0.004388 0.010359
O  2.110305 -0.024372 1.229724
O  1.085236 1.329684 -1.058832
O  1.06146 -1.323851 -1.08065
C  -0.765068 0.001676 0.930019
C  -1.999187 0.009411 -0.009962
C  -3.337787 0.011279 0.764086
C  -4.566856 0.018063 -0.170474
C  3.551576 -0.03502 0.983812
C  1.003988 2.733094 -0.675402
C  0.965483 -2.732243 -0.720125
H  -0.789602 0.88452 1.599494
H  -0.797294 -0.884059 1.595341
H  -1.960726 0.895938 -0.675504
H  -1.96694 -0.872537 -0.681834
H  -3.370972 0.8966 1.431678
H  -3.376571 -0.878125 1.425948
H  -4.570464 -0.87244 -0.826972
H  -5.511718 0.019196 0.403333
H  -4.564976 0.912637 -0.821427
H  3.869905 0.859035 0.413019
H  3.857675 -0.938907 0.421886
H  4.044629 -0.033775 1.969769
H  1.123778 3.321314 -1.59983
H  1.807166 3.011588 0.036051
H  0.023571 2.982981 -0.218956
H  -0.014342 -2.977607 -0.259945
H  1.770645 -3.03266 -0.019936
H  1.070625 -3.306332 -1.655171
