program: Orca
programVersion: 5.0.4
elementType: C H H H
charge: 0
multiplicity: 2
keywords: RIJCOSX NumFreq NoFrozenCore MP2 def2-SVP def2-SVP/C
frequency: 0.00 0.00 0.00 0.00 0.00 0.00 378.66 1439.93 1441.30 3195.29 3414.60 3415.06
frequency: 378.66 1439.93 1441.30 3195.29 3414.60 3415.06
formula: CH3
InChI: InChI=1/CH3/h1H3
4 atoms
C  -5.59223 1.966034 -0.064369
H  -4.568621 2.313656 0.027617
H  -6.103164 1.547876 0.79669
H  -6.102895 2.031643 -1.019358
totalener: -39.53299919 hartree
nucrepener: 9.62397757 hartree
electener: -49.15697676 hartree
oneelecener: -71.41126494 hartree
twoeener: 22.25428818 hartree
kineticenergy: 39.26845863 hartree
s2: 0.761363
energy: -305.9123 -25.3992 -15.7278 -15.7252 -10.5073 5.3167 7.2905 7.2910 16.8773 16.8818 17.5240 18.2839 23.1767 25.4172 25.4208 39.0632 39.0700 47.5104 50.9405 50.9528 54.5552 57.4161 68.5828 68.5868 69.2820 69.2945 86.6625 88.9492 88.9642 electronvolt
energy: -305.2298 -22.9250 -15.3173 -15.3145 3.8522 5.7692 7.4879 7.4884 16.9986 17.0036 18.6803 22.3095 24.0873 25.7860 25.7894 40.4492 40.4546 47.3825 51.0130 51.0248 54.8843 59.6639 69.4000 69.4126 70.0663 70.0719 87.0740 89.2823 89.2979 electronvolt
chargesum: 0.0000000
charge: -0.208748 0.069644 0.069765 0.069340
charge: -0.047708 0.015895 0.015940 0.015872
qa: -0.2087 0.0696 0.0698 0.0693
va: 4.0323 0.9926 0.9926 0.9928
energy: -39.662452774909 hartree
dipole: 0.00151 -0.00113 0.00038 -0.00369 0.00243 -0.00126 -0.00146 0.00054 -0.00092
magnitude: 0.00160 au
magnitude: 0.00408 debye
dipolemethod: MP2 RELAXED
temp: 298.15 k
press: 1.00 atm
zeropoint: 0.03026508 hartree
thermalvibcorrection: 0.00034331 hartree
thermalrotcorrection: 0.00141627 hartree
thermaltrasncorrection: 0.00141627 hartree
thermaltotal: -39.62901185 hartree
thermalcorr: 0.00317585 hartree
nonthermalcorr: 0.03026508 hartree
totalcorr: 0.03344092 hartree
thermalcorrenthalpy: 0.00094421 hartree
totalenthalpy: -39.62806764 hartree
vibrat: 0.00051181 hartree
rotat: 0.00665389 hartree
transl: 0.01618771 hartree
total: 0.02400787 hartree
totalentropycorr: -0.02400787 hartree
gibbsenthalpy: -39.65207551 hartree
gibbsminuselec: 0.01037727 hartree
