program: Orca
programVersion: 5.0.4
elementType: C H H H H
charge: 0
multiplicity: 1
keywords: RIJCOSX NumFreq NoFrozenCore MP2 cc-pVtz cc-pVtz/C
frequency: 0.00 0.00 0.00 0.00 0.00 0.00 1357.78 1358.14 1358.28 1599.10 1599.42 3093.01 3214.82 3214.89 3215.33
frequency: 1357.78 1358.14 1358.28 1599.10 1599.42 3093.01 3214.82 3214.89 3215.33
formula: CH4
InChI: InChI=1/CH4/h1H4
5 atoms
C  -4.520209 2.792112 -0.00759
H  -3.486279 3.057248 -0.187352
H  -5.033237 3.629045 0.448321
H  -4.563501 1.93777 0.655598
H  -4.997585 2.544364 -0.946828
totalener: -40.21358042 hartree
nucrepener: 13.53001417 hartree
electener: -53.74359459 hartree
oneelecener: -79.91028656 hartree
twoeener: 26.16669197 hartree
kineticenergy: 40.19280068 hartree
energy: -304.8595 -25.7338 -14.8725 -14.8718 -14.8711 3.9208 6.2600 6.2603 6.2605 9.9025 9.9033 9.9036 17.5400 17.7021 17.7025 17.7029 18.6674 18.6687 20.6662 29.3725 29.3736 29.3737 31.5171 31.5190 31.5192 35.9463 35.9483 35.9494 41.8354 41.8361 41.8380 43.5888 43.5912 49.4695 65.8677 65.8700 65.8702 69.7292 81.4537 81.4559 81.4577 85.2965 85.3007 85.5734 85.5742 85.5757 90.0920 90.0947 90.0963 98.6021 98.6027 98.6038 102.0142 102.0209 102.0225 103.5287 103.5298 106.0581 111.5698 111.5726 111.5730 112.3308 112.3317 119.7075 119.7101 119.7105 123.9559 123.9575 123.9583 132.2375 138.2323 138.2345 138.2376 149.6365 149.6382 149.6397 150.3987 150.4035 150.4123 152.2434 154.3204 154.3247 169.4543 169.4563 169.4573 397.6852 electronvolt
chargesum: -0.0000000
charge: -0.494191 0.124301 0.122714 0.124553 0.122622
charge: 0.123100 -0.030759 -0.030795 -0.030733 -0.030813
qa: -0.4942 0.1243 0.1227 0.1246 0.1226
va: 3.9965 0.9873 0.9878 0.9872 0.9878
energy: -40.428100710995 hartree
dipole: 0.00016 -0.00007 0.00009 -0.00002 0.00014 0.00012 0.00007 -0.00016 -0.00009
magnitude: 0.00018 au
magnitude: 0.00046 debye
dipolemethod: MP2 RELAXED
temp: 298.15 k
press: 1.00 atm
zeropoint: 0.04558789 hartree
thermalvibcorrection: 0.00003300 hartree
thermalrotcorrection: 0.00141627 hartree
thermaltrasncorrection: 0.00141627 hartree
thermaltotal: -40.37964729 hartree
thermalcorr: 0.00286554 hartree
nonthermalcorr: 0.04558789 hartree
totalcorr: 0.04845343 hartree
thermalcorrenthalpy: 0.00094421 hartree
totalenthalpy: -40.37870308 hartree
vibrat: 0.00003789 hartree
rotat: 0.00582584 hartree
transl: 0.01627961 hartree
total: 0.02214333 hartree
totalentropycorr: -0.02214333 hartree
gibbsenthalpy: -40.40084641 hartree
gibbsminuselec: 0.02725430 hartree
