program: Orca
programVersion: 5.0.4
elementType: C H
charge: 0
multiplicity: 2
keywords: RIJCOSX NumFreq NoFrozenCore MP2 cc-pVtz cc-pVtz/C
frequency: 0.00 0.00 0.00 0.00 0.00 2968.47
frequency: 2968.47
formula: CH
InChI: InChI=1/CH/h1H
2 atoms
C  -4.704511 2.49628 -0.143025
H  -4.953009 2.92833 -1.130505
totalener: -38.28150831 hartree
nucrepener: 2.87041085 hartree
electener: -41.15191916 hartree
oneelecener: -56.68356420 hartree
twoeener: 15.53164504 hartree
kineticenergy: 38.27563875 hartree
s2: 0.758836
energy: -308.0825 -23.9921 -12.8498 -11.5161 1.0778 4.4862 11.1472 11.6479 13.4028 14.0172 16.7190 20.2925 20.7992 22.8467 22.8827 31.2621 33.3367 33.3962 44.9080 62.2152 63.1779 63.9960 68.9374 76.8416 76.8454 79.9681 79.9738 80.1295 80.1840 88.4034 88.4399 88.6926 92.2424 92.3757 97.7494 105.3776 105.3833 112.3427 112.5134 133.8791 137.3053 137.6386 139.6458 236.9981 electronvolt
energy: -307.4610 -21.4521 -11.8093 1.5988 3.0241 4.6911 11.4169 13.7908 14.5500 15.0283 17.2442 20.8573 21.6715 24.4426 24.4503 31.6820 33.3714 34.0541 45.3386 63.5539 64.2084 65.0615 69.4578 77.5888 77.6253 80.3132 81.0799 81.2943 81.5872 88.8939 90.3108 90.6851 92.4096 93.6413 98.0038 105.6026 105.6289 112.2711 112.5694 134.1153 137.3770 138.1392 139.7946 237.4228 electronvolt
chargesum: -0.0000000
charge: -0.129805 0.129805
charge: 0.143414 -0.143414
qa: -0.1298 0.1298
va: 2.0985 0.9583
energy: -38.393648695660 hartree
dipole: -0.21508 0.07761 -0.13748 0.37396 -0.13469 0.23927 -0.85470 0.30802 -0.54668
magnitude: 0.61238 au
magnitude: 1.55654 debye
dipolemethod: MP2 RELAXED
temp: 298.15 k
press: 1.00 atm
zeropoint: 0.00676268 hartree
thermalvibcorrection: 0.00000001 hartree
thermalrotcorrection: 0.00094418 hartree
thermaltrasncorrection: 0.00141627 hartree
thermaltotal: -38.38452556 hartree
thermalcorr: 0.00236046 hartree
nonthermalcorr: 0.00676268 hartree
totalcorr: 0.00912314 hartree
thermalcorrenthalpy: 0.00094421 hartree
totalenthalpy: -38.38358135 hartree
vibrat: 0.00000001 hartree
rotat: 0.00343505 hartree
transl: 0.01598380 hartree
total: 0.02007332 hartree
totalentropycorr: -0.02007332 hartree
gibbsenthalpy: -38.40365467 hartree
gibbsminuselec: -0.01000598 hartree
