program: Orca
programVersion: 5.0.4
elementType: C H H
charge: 0
multiplicity: 3
keywords: Freq RIJCOSX PBEh-3c
frequency: 0.00 0.00 0.00 0.00 0.00 -983.64 -983.50 3312.70 3643.08
frequency: 3312.70 3643.08
formula: CH2
InChI: InChI=1/CH2/h1H2
3 atoms
C  -4.695759 2.38842 -0.112818
H  -4.433905 2.022901 0.852994
H  -4.957626 2.753919 -1.078635
totalener: -39.05411352 hartree
nucrepener: 6.20897513 hartree
electener: -45.26308865 hartree
oneelecener: -64.04517815 hartree
twoeener: 18.78208950 hartree
kineticenergy: 38.79414767 hartree
exchangeener: -3.246288459224 hartree
correlationener: -0.295930851800 hartree
xcener: -3.542219311024 hartree
s2: 2.015407
energy: -284.9332 -20.7628 -14.6508 -8.0454 -8.0448 3.1096 8.1691 14.0838 14.0854 16.1919 18.5834 26.3589 32.5312 45.4483 45.4486 46.6537 46.6547 68.9397 364.6056 electronvolt
energy: -284.0494 -17.8379 -14.1520 0.0086 0.0092 4.1515 8.4584 17.1259 17.1262 17.2830 19.2737 27.8193 32.7079 47.7083 47.7089 50.8672 50.8678 70.2791 365.8529 electronvolt
chargesum: -0.0000000
charge: -0.539302 0.269651 0.269651
charge: -0.324423 0.162211 0.162211
qa: -0.5393 0.2697 0.2697
va: 3.8051 0.9192 0.9192
dispersion: -0.000281613 hartree
energy: -39.053858024067 hartree
dipole: -0.00001 0.00000 -0.00001 -0.00002 0.00001 -0.00001 -0.00000 0.00000 -0.00000
magnitude: 0.00001 au
magnitude: 0.00003 debye
temp: 298.15 k
press: 1.00 atm
zeropoint: 0.01584643 hartree
thermalvibcorrection: 0.00000000 hartree
thermalrotcorrection: 0.00094418 hartree
thermaltrasncorrection: 0.00141627 hartree
thermaltotal: -39.03565114 hartree
thermalcorr: 0.00236045 hartree
nonthermalcorr: 0.01584643 hartree
totalcorr: 0.01820688 hartree
thermalcorrenthalpy: 0.00094421 hartree
totalenthalpy: -39.03470693 hartree
vibrat: 0.00000000 hartree
rotat: 0.00344019 hartree
transl: 0.01608942 hartree
total: 0.02056691 hartree
totalentropycorr: -0.02056691 hartree
gibbsenthalpy: -39.05527384 hartree
gibbsminuselec: -0.00141582 hartree
