program: Orca
programVersion: 5.0.4
elementType: C
charge: 0
multiplicity: 3
keywords: RIJCOSX NoFrozenCore MP2 cc-pVtz cc-pVtz/C
formula: C
InChI: InChI=1/C
1 atoms
C  -4.69274 2.56432 -0.17557
totalener: -37.69156945 hartree
nucrepener: 0.00000000 hartree
electener: -37.69156945 hartree
oneelecener: -50.45238632 hartree
twoeener: 12.76081687 hartree
kineticenergy: 37.69463206 hartree
s2: 2.009037
energy: -308.6941 -22.5344 -11.9107 -11.9107 0.9601 11.5242 11.5242 13.2999 13.4929 22.3183 22.3183 22.8271 22.8271 23.0403 61.4167 61.4167 62.4850 79.8363 79.8877 79.8877 80.0410 80.0410 80.2920 80.2920 87.8971 87.8971 88.1415 88.1415 88.2310 112.2456 electronvolt
energy: -307.4745 -15.8760 1.8687 3.3199 3.3199 14.0317 15.1655 15.3338 15.3338 24.1974 24.4847 24.4847 25.4547 25.4547 63.1882 64.7074 64.7074 80.9365 81.1328 81.1328 81.7284 81.7284 82.7545 82.7545 89.8592 90.3112 90.3112 91.7340 91.7340 113.9316 electronvolt
chargesum: -0.0000000
charge: -0.000000
total: -37.767240615 hartree
energy: -37.767240614729 hartree
dipole: 0.00000 -0.00000 -0.00000 0.00000 0.00000 0.00000 0.00000 0.00000 0.00000
magnitude: 0.00000 au
magnitude: 0.00000 debye
