program: Orca
programVersion: 5.0.4
elementType: C H H H
charge: 0
multiplicity: 2
keywords: Opt RIJCOSX CCSD(T) NUMGRAD def2-TZVP def2-TZVP/C
formula: CH3
InChI: InChI=1/CH3/h1H3
4 atoms
C  -5.591858 1.964918 -0.064683
H  -4.572752 2.312726 0.027463
H  -6.101195 1.549907 0.793539
H  -6.101105 2.031659 -1.015738
totalener: -39.54203043 hartree
nucrepener: 10.38660854 hartree
electener: -49.92863897 hartree
oneelecener: -72.81992424 hartree
twoeener: 22.89128527 hartree
kineticenergy: 39.92060074 hartree
s2: 0.759915
e0: -39.542030548 hartree
ecorr: -0.170144552 hartree
corrType: UHF
s2: 0.761415
e0: -39.574463429 hartree
ecorr: -0.171564262 hartree
s2: 0.761679
e0: -39.576518064 hartree
ecorr: -0.171695579 hartree
s2: 0.761982
e0: -39.577365543 hartree
ecorr: -0.171860236 hartree
s2: 0.761942
e0: -39.577540584 hartree
ecorr: -0.171822739 hartree
s2: 0.761853
e0: -39.577663640 hartree
ecorr: -0.171755208 hartree
s2: 0.761813
e0: -39.577703924 hartree
ecorr: -0.171725069 hartree
s2: 0.761807
e0: -39.577708957 hartree
ecorr: -0.171721133 hartree
s2: 0.761808
energy: -305.6999 -25.7612 -15.7870 -15.7835 -10.4688 4.5397 6.2996 6.3002 8.6503 8.6521 9.3198 9.3577 16.7988 18.3899 18.3939 21.5891 21.5946 28.1838 29.5661 29.5689 42.5146 45.6515 47.5398 49.6059 49.6087 55.8070 57.3248 57.3355 61.7502 63.3687 63.3758 72.1509 72.1626 77.5252 78.2798 78.2880 89.1026 89.1066 93.9929 94.6098 94.6292 96.2996 96.3043 102.8654 107.9266 120.9002 120.9180 132.5098 626.4974 electronvolt
energy: -305.0652 -23.2937 -15.4074 -15.4039 2.9850 4.8681 6.4140 6.4145 8.7379 8.7394 10.0912 12.5798 17.7871 18.6718 18.6755 23.3148 23.3182 29.4940 29.7845 29.7874 43.3247 47.3956 48.3407 50.1256 50.1288 56.4418 57.6333 57.6443 61.7169 63.5675 63.5748 72.3539 72.3656 78.3956 78.4035 78.6773 90.8934 90.8976 95.0847 95.4436 95.4605 96.9494 96.9557 103.7488 108.1022 121.2614 121.2790 132.8932 626.9393 electronvolt
e0: -39.577708123 hartree
ecorr: -0.171721935 hartree
chargesum: -0.0000000
charge: -0.415156 0.138354 0.138416 0.138386
charge: -0.275676 0.091862 0.091907 0.091907
qa: -0.4152 0.1384 0.1384 0.1384
va: 4.0265 0.9820 0.9820 0.9820
energy: -39.753749621197 hartree
dipole: 0.00039 -0.00028 0.00011 -0.00035 0.00017 -0.00018 -0.00051 0.00043 -0.00008
magnitude: 0.00023 au
magnitude: 0.00057 debye
dipolemethod: MDCI
