program: Orca
programVersion: 5.0.4
elementType: C H H H
charge: 0
multiplicity: 2
keywords: RIJCOSX NumFreq CCSD(T) NUMGRAD def2-TZVP def2-TZVP/C
frequency: 0.00 0.00 0.00 0.00 0.00 0.00 496.83 1419.18 1419.57 3115.59 3297.71 3298.50
frequency: 496.83 1419.18 1419.57 3115.59 3297.71 3298.50
formula: CH3
InChI: InChI=1/CH3/h1H3
4 atoms
C  -5.591858 1.964918 -0.064683
H  -4.572752 2.312726 0.027463
H  -6.101195 1.549907 0.793539
H  -6.101105 2.031659 -1.015738
totalener: -39.57770767 hartree
nucrepener: 9.66092621 hartree
electener: -49.23863388 hartree
oneelecener: -71.55209778 hartree
twoeener: 22.31346390 hartree
kineticenergy: 39.52993013 hartree
s2: 0.761808
energy: -305.6999 -25.7612 -15.7870 -15.7835 -10.4688 4.5397 6.2996 6.3002 8.6503 8.6521 9.3198 9.3577 16.7988 18.3899 18.3939 21.5891 21.5946 28.1838 29.5661 29.5689 42.5146 45.6515 47.5398 49.6059 49.6087 55.8070 57.3248 57.3355 61.7502 63.3687 63.3758 72.1509 72.1626 77.5252 78.2798 78.2880 89.1026 89.1066 93.9929 94.6098 94.6292 96.2996 96.3043 102.8654 107.9266 120.9002 120.9180 132.5098 626.4973 electronvolt
energy: -305.0652 -23.2937 -15.4074 -15.4039 2.9850 4.8681 6.4140 6.4145 8.7379 8.7394 10.0912 12.5798 17.7871 18.6718 18.6755 23.3148 23.3182 29.4940 29.7845 29.7874 43.3247 47.3956 48.3407 50.1256 50.1288 56.4418 57.6333 57.6443 61.7169 63.5675 63.5748 72.3539 72.3656 78.3956 78.4035 78.6773 90.8934 90.8976 95.0847 95.4436 95.4605 96.9494 96.9557 103.7488 108.1021 121.2614 121.2790 132.8932 626.9393 electronvolt
e0: -39.577708123 hartree
ecorr: -0.171721935 hartree
corrType: UHF
chargesum: -0.0000000
charge: -0.415156 0.138354 0.138416 0.138386
charge: -0.275676 0.091862 0.091907 0.091907
qa: -0.4152 0.1384 0.1384 0.1384
va: 4.0265 0.9820 0.9820 0.9820
energy: -39.753749621379 hartree
dipole: 0.00039 -0.00028 0.00011 -0.00035 0.00017 -0.00018 -0.00051 0.00043 -0.00008
magnitude: 0.00023 au
magnitude: 0.00057 debye
dipolemethod: MDCI
temp: 298.15 k
press: 1.00 atm
zeropoint: 0.02972413 hartree
thermalvibcorrection: 0.00024021 hartree
thermalrotcorrection: 0.00141627 hartree
thermaltrasncorrection: 0.00141627 hartree
thermaltotal: -39.72095274 hartree
thermalcorr: 0.00307275 hartree
nonthermalcorr: 0.02972413 hartree
totalcorr: 0.03279689 hartree
thermalcorrenthalpy: 0.00094421 hartree
totalenthalpy: -39.72000853 hartree
vibrat: 0.00033271 hartree
rotat: 0.00664304 hartree
transl: 0.01618771 hartree
total: 0.02381790 hartree
totalentropycorr: -0.02381790 hartree
gibbsenthalpy: -39.74382643 hartree
gibbsminuselec: 0.00992319 hartree
