program: Orca
programVersion: 5.0.4
elementType: C H H
charge: 0
multiplicity: 3
keywords: SP WB97X-D4 def2-QZVPP def2-TZVP/C def2/J TightSCF
keywords: NoFrozenCore
formula: CH2
InChI: InChI=1/CH2/h1H2
3 atoms
C  -0.021382 -0.01544 0.055063
H  1.052971 -0.001411 0.005032
H  -0.79818 0.185395 -0.66117
totalener: -39.18409041 hartree
nucrepener: 6.17176838 hartree
electener: -45.35585879 hartree
oneelecener: -63.97252717 hartree
twoeener: 18.61666837 hartree
kineticenergy: 39.01960557 hartree
exchangeener: -3.826388275182 hartree
correlationener: -0.266291651431 hartree
xcener: -4.092679926614 hartree
s2: 2.004729
energy: -280.7331 -22.1277 -15.5280 -10.6145 -9.5969 2.7694 4.1995 5.4160 5.6226 5.9166 7.1129 11.5270 12.1943 13.5394 14.8005 14.9356 18.4552 19.3749 21.7280 22.0790 22.0885 23.2569 23.4186 24.3372 24.9291 30.8014 31.1272 33.7319 36.8856 47.2023 47.3003 47.4595 49.9513 50.6982 51.2594 51.5582 52.3997 53.8978 54.5574 55.4525 58.0410 63.1556 65.4859 65.7148 67.5689 68.4987 70.8074 70.9457 72.7089 73.6677 74.2273 75.3003 75.8593 88.8179 90.5392 94.7940 98.5060 99.0192 102.6975 103.4790 112.0690 131.1072 131.2661 137.7692 139.2884 140.7383 146.2138 149.1218 149.7991 154.1280 155.9242 156.7330 157.4550 159.4229 159.8921 163.7618 165.6633 165.8420 166.9085 168.8957 168.9184 174.5583 176.1441 179.0301 183.5911 183.8519 185.8267 195.6558 200.9071 204.3715 205.4003 205.5158 206.1018 206.2235 209.7104 210.3137 210.3306 221.1021 222.6281 223.3327 224.0560 225.2103 228.8320 236.1431 236.7143 237.2439 237.7381 266.1214 267.7512 273.3583 274.3964 279.2002 296.2558 312.7396 338.9846 774.0891 4010.8199 electronvolt
energy: -280.1090 -19.8859 -14.8761 -0.1653 0.5500 3.0871 4.3962 6.2089 6.4130 6.9523 7.7691 12.1180 12.9069 14.0984 15.7799 15.9489 18.7077 19.7872 21.9559 22.4032 23.4078 23.7148 24.5268 24.5803 25.1218 30.9841 31.2674 34.1590 37.2470 48.1725 48.3812 48.4466 50.9255 52.1095 52.8478 53.1444 53.3315 54.6556 55.4799 56.5677 58.7902 63.6772 65.8920 66.6831 68.1224 69.3528 71.1492 71.5611 73.1065 74.5086 75.2735 75.4756 76.2588 89.3509 90.8937 95.7320 99.2669 99.9981 103.5589 104.5106 112.5577 133.0760 133.2804 139.0401 140.6576 141.9339 147.3888 150.2830 151.0904 155.8634 157.5760 158.6491 158.8165 161.7752 162.9670 165.2059 166.6307 166.8456 167.7953 170.2409 170.2605 175.2258 177.6590 180.8655 184.6797 186.0042 187.7830 196.5925 201.3666 204.7241 205.8493 205.8775 206.5941 206.6818 210.0490 210.6453 210.7407 221.6874 222.7925 223.7128 224.2022 225.7046 229.3245 236.3733 236.9125 237.4836 238.1187 266.6397 268.2816 274.2479 275.2663 279.8139 296.8597 313.1957 339.8997 775.3714 4011.1573 electronvolt
chargesum: -0.0000000
charge: -0.169118 0.084609 0.084509
charge: 0.411779 -0.205844 -0.205935
qa: -0.1691 0.0846 0.0845
va: 3.7729 1.0094 1.0094
dispersion: -0.000603854 hartree
energy: -39.184694264620 hartree
dipole: 0.23904 -0.14864 0.09039 0.17261 -0.10729 0.06532 -0.61557 0.38268 -0.23289
magnitude: 0.25821 au
magnitude: 0.65633 debye
