program: Orca
programVersion: 5.0.4
elementType: C H
charge: 0
multiplicity: 2
keywords: Opt RIJCOSX CCSD(T) NUMGRAD def2-TZVP def2-TZVP/C
formula: CH
InChI: InChI=1/CH/h1H
2 atoms
C  -4.702451 2.492697 -0.134836
H  -4.955069 2.931913 -1.138694
totalener: -38.28564260 hartree
nucrepener: 2.93244759 hartree
electener: -41.21809019 hartree
oneelecener: -56.79480899 hartree
twoeener: 15.57671880 hartree
kineticenergy: 38.30914306 hartree
s2: 1.108498
e0: -38.285642600 hartree
ecorr: -0.118090433 hartree
corrType: UHF
s2: 1.098473
e0: -38.285618543 hartree
ecorr: -0.118994165 hartree
s2: 1.097045
e0: -38.285497041 hartree
ecorr: -0.119123384 hartree
s2: 1.096858
e0: -38.285479117 hartree
ecorr: -0.119140372 hartree
s2: 1.096857
energy: -307.9761 -23.7695 -13.2844 -11.4201 1.2918 4.8926 8.0100 9.0077 9.1776 10.8599 16.8091 21.8481 22.3879 23.0338 23.1941 29.9985 40.6867 44.9040 46.1374 48.1741 55.1338 55.1865 63.2647 75.8038 80.0085 80.0113 80.4262 80.4315 88.2682 88.3931 88.9945 89.2440 93.0109 93.2440 99.1228 120.3182 610.4490 electronvolt
energy: -307.3347 -21.2205 -12.2455 1.7764 2.7949 5.1334 8.4016 9.3635 11.2106 12.1458 17.2924 22.6714 23.5097 24.5358 24.6028 30.4662 41.5881 46.4527 47.8532 48.6506 55.1028 55.6507 63.4110 76.0769 81.0817 81.0911 81.4704 81.4723 89.2709 90.1882 90.5227 90.8789 93.1559 94.1292 99.6216 120.7203 610.8979 electronvolt
e0: -38.285477561 hartree
ecorr: -0.119140588 hartree
chargesum: -0.0000000
charge: -0.122532 0.122532
charge: -0.065421 0.065421
qa: -0.1225 0.1225
va: 2.1517 0.9296
energy: -38.407891549764 hartree
dipole: -0.21865 0.07187 -0.14679 0.38016 -0.14195 0.23820 -0.86888 0.34666 -0.52221
magnitude: 0.59245 au
magnitude: 1.50588 debye
dipolemethod: MDCI
