program: Orca
programVersion: 5.0.4
elementType: C H
charge: 0
multiplicity: 2
keywords: SP CCSD(T) aug-cc-pVQZ def2-TZVP/C def2/J TightSCF
keywords: NoFrozenCore
formula: CH
InChI: InChI=1/CH/h1H
2 atoms
C  0.019558 -0.034005 0.077722
H  -0.23306 0.405211 -0.926137
totalener: -38.28387703 hartree
nucrepener: 2.82358040 hartree
electener: -41.10745743 hartree
oneelecener: -56.58815520 hartree
twoeener: 15.48069777 hartree
kineticenergy: 38.25771578 hartree
s2: 0.759763
energy: -308.2210 -23.9024 -12.8709 -11.5816 0.5007 0.7153 2.1983 2.2651 2.8265 3.4658 5.2706 5.9368 5.9663 6.3533 6.3588 7.7278 7.8651 8.0072 9.2421 11.6086 12.1519 13.1491 14.9747 17.1121 17.1953 17.9976 17.9978 20.1699 20.5733 20.5738 21.0336 21.2347 21.2738 22.6579 22.6964 24.2684 25.0420 25.0558 25.0737 25.1830 29.5177 34.3479 34.7284 39.1181 45.1617 45.1629 45.8151 46.0259 46.4530 52.0472 52.6461 52.6641 53.4199 53.4418 57.6366 57.6666 57.6680 58.0291 58.0375 59.3368 59.4313 61.3932 61.4019 61.7509 61.7512 62.4811 64.6824 65.0398 65.5625 65.5718 65.5971 65.8136 66.0663 72.2673 72.4611 79.3259 87.3720 94.4621 94.7915 96.0692 96.0782 108.9283 112.1619 112.4405 112.5644 159.2851 159.3185 159.5971 159.8099 160.6752 160.6785 161.2984 161.2990 162.6016 168.6822 169.0327 170.0045 170.5182 173.5680 173.5749 176.0856 176.0863 176.3690 178.9046 178.9597 182.3058 184.2898 184.2899 196.6999 198.4618 198.8538 208.2169 208.2185 223.9782 224.2070 226.0410 242.7486 242.7507 248.1449 253.8610 254.1141 270.1762 270.5763 281.2715 328.7339 627.0061 electronvolt
energy: -307.5899 -21.3329 -11.8408 0.7432 0.8041 1.4667 2.2891 3.0492 3.5866 3.8997 5.3401 5.9746 6.2201 6.5169 6.5327 7.7670 8.0456 8.2671 9.4897 11.7671 13.3997 14.2968 15.2594 17.1962 17.5639 18.2753 18.2879 20.4777 20.8012 20.8023 21.1776 21.8901 22.0107 22.7076 23.2218 24.3474 25.0925 25.3905 25.4293 25.5279 29.7914 34.8400 35.4960 39.3547 45.2818 45.2843 46.1669 46.5380 46.9320 52.1957 52.7801 52.7989 53.5702 54.5004 58.0405 58.0415 58.1071 58.6954 58.7133 59.5805 60.4436 62.2824 62.4616 62.4686 62.5418 63.1408 64.7117 65.4309 65.6519 65.8744 65.8864 66.1832 66.6616 72.3138 72.9963 79.7395 87.5916 94.4692 95.0061 96.2969 96.3210 109.0795 112.2649 112.8265 113.0902 159.6174 159.7026 159.8015 160.9135 161.1559 161.3703 162.0259 162.0298 162.9548 168.8349 169.8422 170.1307 171.3170 174.5905 174.6284 176.7619 177.1703 177.1788 179.7241 179.9395 182.5912 184.4175 184.4177 196.8299 198.6419 199.7720 208.3978 208.4047 223.9508 224.2965 226.0874 242.7587 242.7618 248.2372 253.8382 254.1859 270.2164 270.8605 281.3230 328.7977 627.4151 electronvolt
e0: -38.283877135 hartree
ecorr: -0.158438301 hartree
corrType: UHF
chargesum: 0.0000000
charge: -0.276564 0.276564
charge: 0.703057 -0.703057
qa: -0.2766 0.2766
va: 2.1697 0.8488
energy: -38.446420990776 hartree
dipole: -0.21865 0.09315 -0.12550 0.38016 -0.16195 0.21821 -0.86888 0.37015 -0.49872
magnitude: 0.55865 au
magnitude: 1.41998 debye
dipolemethod: MDCI
