program: Orca
programVersion: 5.0.4
elementType: C H H H
charge: 0
multiplicity: 2
keywords: SP CCSD(T) aug-cc-pV5Z aug-cc-pV5Z/C TightSCF
keywords: NoFrozenCore
formula: CH3
InChI: InChI=1/CH3/h1H3
4 atoms
C  -0.000097 0.000095 0.000062
H  1.015407 0.346221 0.091798
H  -0.507145 -0.413687 0.855101
H  -0.507102 0.066337 -0.94764
totalener: -39.58107596 hartree
nucrepener: 9.69707844 hartree
electener: -49.27815440 hartree
oneelecener: -71.62307167 hartree
twoeener: 22.34491727 hartree
kineticenergy: 39.55121379 hartree
s2: 0.761744
e0: -39.581075110 hartree
ecorr: -0.225235860 hartree
corrType: UHF
chargesum: 0.0000000
charge: -0.741724 0.247082 0.247407 0.247235
charge: 1.394675 -0.464937 -0.464900 -0.464838
qa: -0.7417 0.2471 0.2474 0.2472
va: 3.8579 0.9772 0.9770 0.9771
energy: -39.812119554756 hartree
dipole: 0.00109 -0.00084 0.00024 -0.00106 0.00060 -0.00046 -0.00070 0.00054 -0.00016
magnitude: 0.00055 au
magnitude: 0.00139 debye
dipolemethod: MDCI
