program: Orca
programVersion: 5.0.4
elementType: C H H H
charge: 0
multiplicity: 2
keywords: Freq RIJCOSX PBEh-3c
frequency: 0.00 0.00 0.00 0.00 0.00 0.00 489.19 1452.92 1453.73 3216.81 3404.70 3405.68
frequency: 489.19 1452.92 1453.73 3216.81 3404.70 3405.68
formula: CH3
InChI: InChI=1/CH3/h1H3
4 atoms
C  -5.59209 1.965156 -0.064623
H  -4.576586 2.311282 0.027112
H  -6.099138 1.551374 0.790416
H  -6.099095 2.031398 -1.012325
totalener: -39.74849228 hartree
nucrepener: 9.69707844 hartree
electener: -49.44557072 hartree
oneelecener: -71.67317033 hartree
twoeener: 22.22759961 hartree
kineticenergy: 39.44570031 hartree
exchangeener: -3.448163919590 hartree
correlationener: -0.349437627579 hartree
xcener: -3.797601547169 hartree
s2: 0.754657
energy: -284.2271 -20.9677 -12.9958 -12.9909 -7.7164 4.5334 6.2537 6.2576 13.5319 13.5350 14.3466 20.0001 28.3523 28.8837 28.8920 46.3753 46.3804 56.7290 61.1493 61.1716 368.1182 electronvolt
energy: -283.7897 -19.5229 -12.6706 -12.6657 -0.3860 5.0892 6.4302 6.4340 13.8649 13.8676 16.9642 21.0074 29.0146 29.0232 29.1941 48.3556 48.3596 58.9124 61.4792 61.5015 368.7492 electronvolt
chargesum: -0.0000000
charge: -0.662261 0.220731 0.220763 0.220768
charge: -0.392279 0.130724 0.130776 0.130779
qa: -0.6623 0.2207 0.2208 0.2208
va: 3.7933 0.9247 0.9248 0.9248
dispersion: -0.000481961 hartree
energy: -39.748127743177 hartree
dipole: 0.00109 -0.00085 0.00024 -0.00106 0.00057 -0.00049 -0.00070 0.00047 -0.00023
magnitude: 0.00059 au
magnitude: 0.00151 debye
temp: 298.15 k
press: 1.00 atm
zeropoint: 0.03057993 hartree
thermalvibcorrection: 0.00024417 hartree
thermalrotcorrection: 0.00141627 hartree
thermaltrasncorrection: 0.00141627 hartree
thermaltotal: -39.71447110 hartree
thermalcorr: 0.00307672 hartree
nonthermalcorr: 0.03057993 hartree
totalcorr: 0.03365665 hartree
thermalcorrenthalpy: 0.00094421 hartree
totalenthalpy: -39.71352689 hartree
vibrat: 0.00033994 hartree
rotat: 0.00663246 hartree
transl: 0.01618771 hartree
total: 0.02381456 hartree
totalentropycorr: -0.02381456 hartree
gibbsenthalpy: -39.73734145 hartree
gibbsminuselec: 0.01078629 hartree
